config.log   [plain text]


This file contains any messages produced by compilers while
running configure, to aid debugging if configure makes a mistake.

It was created by configure, which was
generated by GNU Autoconf 2.62.  Invocation command line was

  $ auto/configure --prefix=/usr --mandir=/usr/share/man --infodir=/usr/share/info --disable-dependency-tracking --enable-cscope --enable-gui=no --without-x --enable-multibyte --disable-darwin --with-tlib=ncurses --srcdir=. --cache-file=auto/config.cache --srcdir=. --cache-file=auto/config.cache

## --------- ##
## Platform. ##
## --------- ##

hostname = il0204d-dhcp14.apple.com
uname -m = i386
uname -r = 10.0.0
uname -s = Darwin
uname -v = Darwin Kernel Version 10.0.0: Fri Jul 31 22:47:34 PDT 2009; root:xnu-1456.1.25~1/RELEASE_I386

/usr/bin/uname -p = i386
/bin/uname -X     = unknown

/bin/arch              = unknown
/usr/bin/arch -k       = unknown
/usr/convex/getsysinfo = unknown
/usr/bin/hostinfo      = Mach kernel version:
	 Darwin Kernel Version 10.0.0: Fri Jul 31 22:47:34 PDT 2009; root:xnu-1456.1.25~1/RELEASE_I386
Kernel configured for up to 2 processors.
2 processors are physically available.
2 processors are logically available.
Processor type: i486 (Intel 80486)
Processors active: 0 1
Primary memory available: 2.00 gigabytes
Default processor set: 92 tasks, 296 threads, 2 processors
Load average: 0.36, Mach factor: 1.63
/bin/machine           = unknown
/usr/bin/oslevel       = unknown
/bin/universe          = unknown

PATH: /usr/bin
PATH: /bin
PATH: /usr/sbin
PATH: /sbin
PATH: /usr/local/bin
PATH: /usr/X11/bin
PATH: /Volumes/data/stripes/bin
PATH: /Volumes/data/stripes/bin
PATH: /sbin
PATH: /usr/sbin


## ----------- ##
## Core tests. ##
## ----------- ##

configure:1875: creating cache auto/config.cache
configure:1968: checking whether make sets $(MAKE)
configure:1990: result: yes
configure:2048: checking for gcc
configure:2064: found /usr/bin/gcc
configure:2075: result: gcc
configure:2313: checking for C compiler version
configure:2321: gcc --version >&5
i686-apple-darwin10-gcc-4.2.1 (GCC) 4.2.1 (Apple Inc. build 5646)
Copyright (C) 2007 Free Software Foundation, Inc.
This is free software; see the source for copying conditions.  There is NO
warranty; not even for MERCHANTABILITY or FITNESS FOR A PARTICULAR PURPOSE.

configure:2325: $? = 0
configure:2332: gcc -v >&5
Using built-in specs.
Target: i686-apple-darwin10
Configured with: /var/tmp/gcc/gcc-5646~6/src/configure --disable-checking --enable-werror --prefix=/usr --mandir=/share/man --enable-languages=c,objc,c++,obj-c++ --program-transform-name=/^[cg][^.-]*$/s/$/-4.2/ --with-slibdir=/usr/lib --build=i686-apple-darwin10 --with-gxx-include-dir=/include/c++/4.2.1 --program-prefix=i686-apple-darwin10- --host=x86_64-apple-darwin10 --target=i686-apple-darwin10
Thread model: posix
gcc version 4.2.1 (Apple Inc. build 5646)
configure:2336: $? = 0
configure:2343: gcc -V >&5
gcc-4.2: argument to `-V' is missing
configure:2347: $? = 1
configure:2370: checking for C compiler default output file name
configure:2392: gcc -arch i386 -arch x86_64 -g -Os -pipe -mdynamic-no-pic  -arch i386 -arch x86_64 conftest.c  >&5
configure:2396: $? = 0
configure:2434: result: a.out
configure:2451: checking whether the C compiler works
configure:2461: ./a.out
configure:2465: $? = 0
configure:2482: result: yes
configure:2489: checking whether we are cross compiling
configure:2491: result: no
configure:2494: checking for suffix of executables
configure:2501: gcc -o conftest -arch i386 -arch x86_64 -g -Os -pipe -mdynamic-no-pic  -arch i386 -arch x86_64 conftest.c  >&5
configure:2505: $? = 0
configure:2529: result: 
configure:2535: checking for suffix of object files
configure:2561: gcc -c -arch i386 -arch x86_64 -g -Os -pipe -mdynamic-no-pic  conftest.c >&5
configure:2565: $? = 0
configure:2588: result: o
configure:2592: checking whether we are using the GNU C compiler
configure:2621: gcc -c -arch i386 -arch x86_64 -g -Os -pipe -mdynamic-no-pic  conftest.c >&5
configure:2628: $? = 0
configure:2645: result: yes
configure:2654: checking whether gcc accepts -g
configure:2684: gcc -c -g  conftest.c >&5
configure:2691: $? = 0
configure:2792: result: yes
configure:2809: checking for gcc option to accept ISO C89
configure:2883: gcc  -c -arch i386 -arch x86_64 -g -Os -pipe -mdynamic-no-pic  conftest.c >&5
configure:2890: $? = 0
configure:2913: result: none needed
configure:2935: checking how to run the C preprocessor
configure:2975: gcc -E  conftest.c
configure:2982: $? = 0
configure:3013: gcc -E  conftest.c
conftest.c:9:28: error: ac_nonexistent.h: No such file or directory
configure:3020: $? = 1
configure: failed program was:
| /* confdefs.h.  */
| #define PACKAGE_NAME ""
| #define PACKAGE_TARNAME ""
| #define PACKAGE_VERSION ""
| #define PACKAGE_STRING ""
| #define PACKAGE_BUGREPORT ""
| #define UNIX 1
| /* end confdefs.h.  */
| #include <ac_nonexistent.h>
configure:3053: result: gcc -E
configure:3082: gcc -E  conftest.c
configure:3089: $? = 0
configure:3120: gcc -E  conftest.c
conftest.c:9:28: error: ac_nonexistent.h: No such file or directory
configure:3127: $? = 1
configure: failed program was:
| /* confdefs.h.  */
| #define PACKAGE_NAME ""
| #define PACKAGE_TARNAME ""
| #define PACKAGE_VERSION ""
| #define PACKAGE_STRING ""
| #define PACKAGE_BUGREPORT ""
| #define UNIX 1
| /* end confdefs.h.  */
| #include <ac_nonexistent.h>
configure:3165: checking for grep that handles long lines and -e
configure:3225: result: /usr/bin/grep
configure:3230: checking for egrep
configure:3294: result: /usr/bin/grep -E
configure:3308: checking for library containing strerror
configure:3349: gcc -o conftest -arch i386 -arch x86_64 -g -Os -pipe -mdynamic-no-pic  -arch i386 -arch x86_64 conftest.c  >&5
configure:3356: $? = 0
configure:3387: result: none required
configure:3398: checking for gawk
configure:3428: result: no
configure:3398: checking for mawk
configure:3428: result: no
configure:3398: checking for nawk
configure:3428: result: no
configure:3398: checking for awk
configure:3414: found /usr/bin/awk
configure:3425: result: awk
configure:3438: checking for strip
configure:3454: found /usr/bin/strip
configure:3466: result: strip
configure:3477: checking for ANSI C header files
configure:3507: gcc -c -arch i386 -arch x86_64 -g -Os -pipe -mdynamic-no-pic  conftest.c >&5
configure:3514: $? = 0
configure:3613: gcc -o conftest -arch i386 -arch x86_64 -g -Os -pipe -mdynamic-no-pic  -arch i386 -arch x86_64 conftest.c  >&5
configure:3617: $? = 0
configure:3623: ./conftest
configure:3627: $? = 0
configure:3645: result: yes
configure:3655: checking for sys/wait.h that is POSIX.1 compatible
configure:3691: gcc -c -arch i386 -arch x86_64 -g -Os -pipe -mdynamic-no-pic  conftest.c >&5
configure:3698: $? = 0
configure:3713: result: yes
configure:3752: checking for buggy tools...
configure:3759: checking for BeOS
configure:3765: result: no
configure:3769: checking for QNX
configure:3776: result: no
configure:3780: checking for Darwin (Mac OS X)
configure:3783: result: yes
configure:3786: checking --disable-darwin argument
configure:3809: result: yes, Darwin support excluded
configure:3813: checking --with-mac-arch argument
configure:3821: result: defaulting to current
configure:4182: checking --with-local-dir argument
configure:4208: result: Defaulting to /usr/local
configure:4233: checking --with-vim-name argument
configure:4241: result: Defaulting to vim
configure:4246: checking --with-ex-name argument
configure:4254: result: Defaulting to ex
configure:4259: checking --with-view-name argument
configure:4267: result: Defaulting to view
configure:4273: checking --with-global-runtime argument
configure:4284: result: no
configure:4289: checking --with-modified-by argument
configure:4300: result: no
configure:4305: checking if character set is EBCDIC
configure:4334: gcc -c -arch i386 -arch x86_64 -g -Os -pipe -mdynamic-no-pic  conftest.c >&5
conftest.c: In function 'main':
conftest.c:20: error: 'make' undeclared (first use in this function)
conftest.c:20: error: (Each undeclared identifier is reported only once
conftest.c:20: error: for each function it appears in.)
conftest.c:20: error: expected ';' before 'an'
conftest.c: In function 'main':
conftest.c:20: error: 'make' undeclared (first use in this function)
conftest.c:20: error: (Each undeclared identifier is reported only once
conftest.c:20: error: for each function it appears in.)
conftest.c:20: error: expected ';' before 'an'
lipo: can't open input file: /var/folders/IQ/IQuL0Q24Fna8hK1dP+jLgU+++TM/-Tmp-//ccBDLflk.out (No such file or directory)
configure:4341: $? = 1
configure: failed program was:
| /* confdefs.h.  */
| #define PACKAGE_NAME ""
| #define PACKAGE_TARNAME ""
| #define PACKAGE_VERSION ""
| #define PACKAGE_STRING ""
| #define PACKAGE_BUGREPORT ""
| #define UNIX 1
| #define STDC_HEADERS 1
| #define HAVE_SYS_WAIT_H 1
| /* end confdefs.h.  */
| 
| int
| main ()
| {
|  /* TryCompile function for CharSet.
|    Treat any failure as ASCII for compatibility with existing art.
|    Use compile-time rather than run-time tests for cross-compiler
|    tolerance.  */
| #if '0'!=240
| make an error "Character set is not EBCDIC"
| #endif
|   ;
|   return 0;
| }
configure:4359: result: no
configure:4410: checking --disable-selinux argument
configure:4420: result: no
configure:4422: checking for is_selinux_enabled in -lselinux
configure:4457: gcc -o conftest -arch i386 -arch x86_64 -g -Os -pipe -mdynamic-no-pic  -arch i386 -arch x86_64 -L/usr/local/lib conftest.c -lselinux   >&5
ld: library not found for -lselinux
collect2: ld returned 1 exit status
ld: library not found for -lselinux
collect2: ld returned 1 exit status
lipo: can't open input file: /var/folders/IQ/IQuL0Q24Fna8hK1dP+jLgU+++TM/-Tmp-//ccXeWxpt.out (No such file or directory)
configure:4464: $? = 1
configure: failed program was:
| /* confdefs.h.  */
| #define PACKAGE_NAME ""
| #define PACKAGE_TARNAME ""
| #define PACKAGE_VERSION ""
| #define PACKAGE_STRING ""
| #define PACKAGE_BUGREPORT ""
| #define UNIX 1
| #define STDC_HEADERS 1
| #define HAVE_SYS_WAIT_H 1
| /* end confdefs.h.  */
| 
| /* Override any GCC internal prototype to avoid an error.
|    Use char because int might match the return type of a GCC
|    builtin and then its argument prototype would still apply.  */
| #ifdef __cplusplus
| extern "C"
| #endif
| char is_selinux_enabled ();
| int
| main ()
| {
| return is_selinux_enabled ();
|   ;
|   return 0;
| }
configure:4485: result: no
configure:4501: checking --with-features argument
configure:4509: result: Defaulting to normal
configure:4547: checking --with-compiledby argument
configure:4555: result: no
configure:4561: checking --disable-xsmp argument
configure:4572: result: no
configure:4574: checking --disable-xsmp-interact argument
configure:4584: result: no
configure:4599: checking --enable-mzschemeinterp argument
configure:4608: result: no
configure:4766: checking --enable-perlinterp argument
configure:4775: result: no
configure:4969: checking --enable-pythoninterp argument
configure:4978: result: no
configure:5317: checking --enable-tclinterp argument
configure:5326: result: no
configure:5659: checking --enable-rubyinterp argument
configure:5668: result: no
configure:5773: checking --enable-cscope argument
configure:5782: result: yes
configure:5791: checking --enable-workshop argument
configure:5800: result: no
configure:5816: checking --disable-netbeans argument
configure:5826: result: no
configure:5829: checking for socket in -lsocket
configure:5864: gcc -o conftest -arch i386 -arch x86_64 -g -Os -pipe -mdynamic-no-pic  -arch i386 -arch x86_64 -L/usr/local/lib conftest.c -lsocket   >&5
ld: library not found for -lsocket
collect2: ld returned 1 exit status
ld: library not found for -lsocket
collect2: ld returned 1 exit status
lipo: can't open input file: /var/folders/IQ/IQuL0Q24Fna8hK1dP+jLgU+++TM/-Tmp-//ccQuZLEH.out (No such file or directory)
configure:5871: $? = 1
configure: failed program was:
| /* confdefs.h.  */
| #define PACKAGE_NAME ""
| #define PACKAGE_TARNAME ""
| #define PACKAGE_VERSION ""
| #define PACKAGE_STRING ""
| #define PACKAGE_BUGREPORT ""
| #define UNIX 1
| #define STDC_HEADERS 1
| #define HAVE_SYS_WAIT_H 1
| #define FEAT_NORMAL 1
| #define USE_XSMP_INTERACT 1
| #define FEAT_CSCOPE 1
| /* end confdefs.h.  */
| 
| /* Override any GCC internal prototype to avoid an error.
|    Use char because int might match the return type of a GCC
|    builtin and then its argument prototype would still apply.  */
| #ifdef __cplusplus
| extern "C"
| #endif
| char socket ();
| int
| main ()
| {
| return socket ();
|   ;
|   return 0;
| }
configure:5892: result: no
configure:5904: checking for gethostbyname in -lnsl
configure:5939: gcc -o conftest -arch i386 -arch x86_64 -g -Os -pipe -mdynamic-no-pic  -arch i386 -arch x86_64 -L/usr/local/lib conftest.c -lnsl   >&5
ld: library not found for -lnsl
collect2: ld returned 1 exit status
ld: library not found for -lnsl
collect2: ld returned 1 exit status
lipo: can't open input file: /var/folders/IQ/IQuL0Q24Fna8hK1dP+jLgU+++TM/-Tmp-//ccUAi44K.out (No such file or directory)
configure:5946: $? = 1
configure: failed program was:
| /* confdefs.h.  */
| #define PACKAGE_NAME ""
| #define PACKAGE_TARNAME ""
| #define PACKAGE_VERSION ""
| #define PACKAGE_STRING ""
| #define PACKAGE_BUGREPORT ""
| #define UNIX 1
| #define STDC_HEADERS 1
| #define HAVE_SYS_WAIT_H 1
| #define FEAT_NORMAL 1
| #define USE_XSMP_INTERACT 1
| #define FEAT_CSCOPE 1
| /* end confdefs.h.  */
| 
| /* Override any GCC internal prototype to avoid an error.
|    Use char because int might match the return type of a GCC
|    builtin and then its argument prototype would still apply.  */
| #ifdef __cplusplus
| extern "C"
| #endif
| char gethostbyname ();
| int
| main ()
| {
| return gethostbyname ();
|   ;
|   return 0;
| }
configure:5967: result: no
configure:5978: checking whether compiling netbeans integration is possible
configure:6024: gcc -o conftest -arch i386 -arch x86_64 -g -Os -pipe -mdynamic-no-pic  -arch i386 -arch x86_64 -L/usr/local/lib conftest.c  >&5
configure:6031: $? = 0
configure:6039: result: yes
configure:6067: checking --enable-sniff argument
configure:6076: result: no
configure:6089: checking --enable-multibyte argument
configure:6098: result: yes
configure:6107: checking --enable-hangulinput argument
configure:6116: result: no
configure:6119: checking --enable-xim argument
configure:6126: result: defaulting to auto
configure:6131: checking --enable-fontset argument
configure:6140: result: no
configure:6146: result: defaulting to: don't HAVE_X11
configure:7978: checking --enable-gui argument
configure:8038: result: no GUI support
configure:9583: checking X11/SM/SMlib.h usability
configure:9600: gcc -c -arch i386 -arch x86_64 -g -Os -pipe -mdynamic-no-pic   conftest.c >&5
configure:9607: $? = 0
configure:9621: result: yes
configure:9625: checking X11/SM/SMlib.h presence
configure:9640: gcc -E   conftest.c
configure:9647: $? = 0
configure:9661: result: yes
configure:9689: checking for X11/SM/SMlib.h
configure:9698: result: yes
configure:10240: checking whether toupper is broken
configure:10270: gcc -o conftest -arch i386 -arch x86_64 -g -Os -pipe -mdynamic-no-pic  -arch i386 -arch x86_64 -L/usr/local/lib conftest.c  >&5
configure:10274: $? = 0
configure:10280: ./conftest
configure:10284: $? = 1
configure: program exited with status 1
configure: failed program was:
| 
| #include "confdefs.h"
| #include <ctype.h>
| #if STDC_HEADERS
| # include <stdlib.h>
| # include <stddef.h>
| #endif
| main() { exit(toupper('A') == 'A' && tolower('z') == 'z'); }
| 
configure:10305: result: no
configure:10315: checking whether __DATE__ and __TIME__ work
configure:10338: gcc -c -arch i386 -arch x86_64 -g -Os -pipe -mdynamic-no-pic  conftest.c >&5
configure:10345: $? = 0
configure:10350: result: yes
configure:10375: checking elf.h usability
configure:10392: gcc -c -arch i386 -arch x86_64 -g -Os -pipe -mdynamic-no-pic  conftest.c >&5
conftest.c:51:17: error: elf.h: No such file or directory
conftest.c:51:17: error: elf.h: No such file or directory
lipo: can't open input file: /var/folders/IQ/IQuL0Q24Fna8hK1dP+jLgU+++TM/-Tmp-//cceJKGnI.out (No such file or directory)
configure:10399: $? = 1
configure: failed program was:
| /* confdefs.h.  */
| #define PACKAGE_NAME ""
| #define PACKAGE_TARNAME ""
| #define PACKAGE_VERSION ""
| #define PACKAGE_STRING ""
| #define PACKAGE_BUGREPORT ""
| #define UNIX 1
| #define STDC_HEADERS 1
| #define HAVE_SYS_WAIT_H 1
| #define FEAT_NORMAL 1
| #define USE_XSMP_INTERACT 1
| #define FEAT_CSCOPE 1
| #define FEAT_NETBEANS_INTG 1
| #define FEAT_MBYTE 1
| #define HAVE_X11_SM_SMLIB_H 1
| #define HAVE_DATE_TIME 1
| /* end confdefs.h.  */
| #include <stdio.h>
| #ifdef HAVE_SYS_TYPES_H
| # include <sys/types.h>
| #endif
| #ifdef HAVE_SYS_STAT_H
| # include <sys/stat.h>
| #endif
| #ifdef STDC_HEADERS
| # include <stdlib.h>
| # include <stddef.h>
| #else
| # ifdef HAVE_STDLIB_H
| #  include <stdlib.h>
| # endif
| #endif
| #ifdef HAVE_STRING_H
| # if !defined STDC_HEADERS && defined HAVE_MEMORY_H
| #  include <memory.h>
| # endif
| # include <string.h>
| #endif
| #ifdef HAVE_STRINGS_H
| # include <strings.h>
| #endif
| #ifdef HAVE_INTTYPES_H
| # include <inttypes.h>
| #endif
| #ifdef HAVE_STDINT_H
| # include <stdint.h>
| #endif
| #ifdef HAVE_UNISTD_H
| # include <unistd.h>
| #endif
| #include <elf.h>
configure:10413: result: no
configure:10417: checking elf.h presence
configure:10432: gcc -E  conftest.c
conftest.c:18:17: error: elf.h: No such file or directory
configure:10439: $? = 1
configure: failed program was:
| /* confdefs.h.  */
| #define PACKAGE_NAME ""
| #define PACKAGE_TARNAME ""
| #define PACKAGE_VERSION ""
| #define PACKAGE_STRING ""
| #define PACKAGE_BUGREPORT ""
| #define UNIX 1
| #define STDC_HEADERS 1
| #define HAVE_SYS_WAIT_H 1
| #define FEAT_NORMAL 1
| #define USE_XSMP_INTERACT 1
| #define FEAT_CSCOPE 1
| #define FEAT_NETBEANS_INTG 1
| #define FEAT_MBYTE 1
| #define HAVE_X11_SM_SMLIB_H 1
| #define HAVE_DATE_TIME 1
| /* end confdefs.h.  */
| #include <elf.h>
configure:10453: result: no
configure:10481: checking for elf.h
configure:10488: result: no
configure:10577: checking for dirent.h that defines DIR
configure:10606: gcc -c -arch i386 -arch x86_64 -g -Os -pipe -mdynamic-no-pic  conftest.c >&5
configure:10613: $? = 0
configure:10630: result: yes
configure:10644: checking for library containing opendir
configure:10685: gcc -o conftest -arch i386 -arch x86_64 -g -Os -pipe -mdynamic-no-pic  -arch i386 -arch x86_64 -L/usr/local/lib conftest.c  >&5
configure:10692: $? = 0
configure:10723: result: none required
configure:10942: checking stdarg.h usability
configure:10959: gcc -c -arch i386 -arch x86_64 -g -Os -pipe -mdynamic-no-pic  conftest.c >&5
configure:10966: $? = 0
configure:10980: result: yes
configure:10984: checking stdarg.h presence
configure:10999: gcc -E  conftest.c
configure:11006: $? = 0
configure:11020: result: yes
configure:11048: checking for stdarg.h
configure:11057: result: yes
configure:10942: checking stdlib.h usability
configure:10959: gcc -c -arch i386 -arch x86_64 -g -Os -pipe -mdynamic-no-pic  conftest.c >&5
configure:10966: $? = 0
configure:10980: result: yes
configure:10984: checking stdlib.h presence
configure:10999: gcc -E  conftest.c
configure:11006: $? = 0
configure:11020: result: yes
configure:11048: checking for stdlib.h
configure:11057: result: yes
configure:10942: checking string.h usability
configure:10959: gcc -c -arch i386 -arch x86_64 -g -Os -pipe -mdynamic-no-pic  conftest.c >&5
configure:10966: $? = 0
configure:10980: result: yes
configure:10984: checking string.h presence
configure:10999: gcc -E  conftest.c
configure:11006: $? = 0
configure:11020: result: yes
configure:11048: checking for string.h
configure:11057: result: yes
configure:10942: checking sys/select.h usability
configure:10959: gcc -c -arch i386 -arch x86_64 -g -Os -pipe -mdynamic-no-pic  conftest.c >&5
configure:10966: $? = 0
configure:10980: result: yes
configure:10984: checking sys/select.h presence
configure:10999: gcc -E  conftest.c
configure:11006: $? = 0
configure:11020: result: yes
configure:11048: checking for sys/select.h
configure:11057: result: yes
configure:10942: checking sys/utsname.h usability
configure:10959: gcc -c -arch i386 -arch x86_64 -g -Os -pipe -mdynamic-no-pic  conftest.c >&5
configure:10966: $? = 0
configure:10980: result: yes
configure:10984: checking sys/utsname.h presence
configure:10999: gcc -E  conftest.c
configure:11006: $? = 0
configure:11020: result: yes
configure:11048: checking for sys/utsname.h
configure:11057: result: yes
configure:10942: checking termcap.h usability
configure:10959: gcc -c -arch i386 -arch x86_64 -g -Os -pipe -mdynamic-no-pic  conftest.c >&5
configure:10966: $? = 0
configure:10980: result: yes
configure:10984: checking termcap.h presence
configure:10999: gcc -E  conftest.c
configure:11006: $? = 0
configure:11020: result: yes
configure:11048: checking for termcap.h
configure:11057: result: yes
configure:10942: checking fcntl.h usability
configure:10959: gcc -c -arch i386 -arch x86_64 -g -Os -pipe -mdynamic-no-pic  conftest.c >&5
configure:10966: $? = 0
configure:10980: result: yes
configure:10984: checking fcntl.h presence
configure:10999: gcc -E  conftest.c
configure:11006: $? = 0
configure:11020: result: yes
configure:11048: checking for fcntl.h
configure:11057: result: yes
configure:10942: checking sgtty.h usability
configure:10959: gcc -c -arch i386 -arch x86_64 -g -Os -pipe -mdynamic-no-pic  conftest.c >&5
configure:10966: $? = 0
configure:10980: result: yes
configure:10984: checking sgtty.h presence
configure:10999: gcc -E  conftest.c
configure:11006: $? = 0
configure:11020: result: yes
configure:11048: checking for sgtty.h
configure:11057: result: yes
configure:10942: checking sys/ioctl.h usability
configure:10959: gcc -c -arch i386 -arch x86_64 -g -Os -pipe -mdynamic-no-pic  conftest.c >&5
configure:10966: $? = 0
configure:10980: result: yes
configure:10984: checking sys/ioctl.h presence
configure:10999: gcc -E  conftest.c
configure:11006: $? = 0
configure:11020: result: yes
configure:11048: checking for sys/ioctl.h
configure:11057: result: yes
configure:10942: checking sys/time.h usability
configure:10959: gcc -c -arch i386 -arch x86_64 -g -Os -pipe -mdynamic-no-pic  conftest.c >&5
configure:10966: $? = 0
configure:10980: result: yes
configure:10984: checking sys/time.h presence
configure:10999: gcc -E  conftest.c
configure:11006: $? = 0
configure:11020: result: yes
configure:11048: checking for sys/time.h
configure:11057: result: yes
configure:10942: checking sys/types.h usability
configure:10959: gcc -c -arch i386 -arch x86_64 -g -Os -pipe -mdynamic-no-pic  conftest.c >&5
configure:10966: $? = 0
configure:10980: result: yes
configure:10984: checking sys/types.h presence
configure:10999: gcc -E  conftest.c
configure:11006: $? = 0
configure:11020: result: yes
configure:11048: checking for sys/types.h
configure:11057: result: yes
configure:10942: checking termio.h usability
configure:10959: gcc -c -arch i386 -arch x86_64 -g -Os -pipe -mdynamic-no-pic  conftest.c >&5
conftest.c:63:20: error: termio.h: No such file or directory
conftest.c:63:20: error: termio.h: No such file or directory
lipo: can't open input file: /var/folders/IQ/IQuL0Q24Fna8hK1dP+jLgU+++TM/-Tmp-//ccTLdAIM.out (No such file or directory)
configure:10966: $? = 1
configure: failed program was:
| /* confdefs.h.  */
| #define PACKAGE_NAME ""
| #define PACKAGE_TARNAME ""
| #define PACKAGE_VERSION ""
| #define PACKAGE_STRING ""
| #define PACKAGE_BUGREPORT ""
| #define UNIX 1
| #define STDC_HEADERS 1
| #define HAVE_SYS_WAIT_H 1
| #define FEAT_NORMAL 1
| #define USE_XSMP_INTERACT 1
| #define FEAT_CSCOPE 1
| #define FEAT_NETBEANS_INTG 1
| #define FEAT_MBYTE 1
| #define HAVE_X11_SM_SMLIB_H 1
| #define HAVE_DATE_TIME 1
| #define HAVE_DIRENT_H 1
| #define HAVE_STDARG_H 1
| #define HAVE_STDLIB_H 1
| #define HAVE_STRING_H 1
| #define HAVE_SYS_SELECT_H 1
| #define HAVE_SYS_UTSNAME_H 1
| #define HAVE_TERMCAP_H 1
| #define HAVE_FCNTL_H 1
| #define HAVE_SGTTY_H 1
| #define HAVE_SYS_IOCTL_H 1
| #define HAVE_SYS_TIME_H 1
| #define HAVE_SYS_TYPES_H 1
| /* end confdefs.h.  */
| #include <stdio.h>
| #ifdef HAVE_SYS_TYPES_H
| # include <sys/types.h>
| #endif
| #ifdef HAVE_SYS_STAT_H
| # include <sys/stat.h>
| #endif
| #ifdef STDC_HEADERS
| # include <stdlib.h>
| # include <stddef.h>
| #else
| # ifdef HAVE_STDLIB_H
| #  include <stdlib.h>
| # endif
| #endif
| #ifdef HAVE_STRING_H
| # if !defined STDC_HEADERS && defined HAVE_MEMORY_H
| #  include <memory.h>
| # endif
| # include <string.h>
| #endif
| #ifdef HAVE_STRINGS_H
| # include <strings.h>
| #endif
| #ifdef HAVE_INTTYPES_H
| # include <inttypes.h>
| #endif
| #ifdef HAVE_STDINT_H
| # include <stdint.h>
| #endif
| #ifdef HAVE_UNISTD_H
| # include <unistd.h>
| #endif
| #include <termio.h>
configure:10980: result: no
configure:10984: checking termio.h presence
configure:10999: gcc -E  conftest.c
conftest.c:30:20: error: termio.h: No such file or directory
configure:11006: $? = 1
configure: failed program was:
| /* confdefs.h.  */
| #define PACKAGE_NAME ""
| #define PACKAGE_TARNAME ""
| #define PACKAGE_VERSION ""
| #define PACKAGE_STRING ""
| #define PACKAGE_BUGREPORT ""
| #define UNIX 1
| #define STDC_HEADERS 1
| #define HAVE_SYS_WAIT_H 1
| #define FEAT_NORMAL 1
| #define USE_XSMP_INTERACT 1
| #define FEAT_CSCOPE 1
| #define FEAT_NETBEANS_INTG 1
| #define FEAT_MBYTE 1
| #define HAVE_X11_SM_SMLIB_H 1
| #define HAVE_DATE_TIME 1
| #define HAVE_DIRENT_H 1
| #define HAVE_STDARG_H 1
| #define HAVE_STDLIB_H 1
| #define HAVE_STRING_H 1
| #define HAVE_SYS_SELECT_H 1
| #define HAVE_SYS_UTSNAME_H 1
| #define HAVE_TERMCAP_H 1
| #define HAVE_FCNTL_H 1
| #define HAVE_SGTTY_H 1
| #define HAVE_SYS_IOCTL_H 1
| #define HAVE_SYS_TIME_H 1
| #define HAVE_SYS_TYPES_H 1
| /* end confdefs.h.  */
| #include <termio.h>
configure:11020: result: no
configure:11048: checking for termio.h
configure:11057: result: no
configure:10942: checking iconv.h usability
configure:10959: gcc -c -arch i386 -arch x86_64 -g -Os -pipe -mdynamic-no-pic  conftest.c >&5
configure:10966: $? = 0
configure:10980: result: yes
configure:10984: checking iconv.h presence
configure:10999: gcc -E  conftest.c
configure:11006: $? = 0
configure:11020: result: yes
configure:11048: checking for iconv.h
configure:11057: result: yes
configure:10942: checking langinfo.h usability
configure:10959: gcc -c -arch i386 -arch x86_64 -g -Os -pipe -mdynamic-no-pic  conftest.c >&5
configure:10966: $? = 0
configure:10980: result: yes
configure:10984: checking langinfo.h presence
configure:10999: gcc -E  conftest.c
configure:11006: $? = 0
configure:11020: result: yes
configure:11048: checking for langinfo.h
configure:11057: result: yes
configure:10942: checking math.h usability
configure:10959: gcc -c -arch i386 -arch x86_64 -g -Os -pipe -mdynamic-no-pic  conftest.c >&5
configure:10966: $? = 0
configure:10980: result: yes
configure:10984: checking math.h presence
configure:10999: gcc -E  conftest.c
configure:11006: $? = 0
configure:11020: result: yes
configure:11048: checking for math.h
configure:11057: result: yes
configure:10942: checking unistd.h usability
configure:10959: gcc -c -arch i386 -arch x86_64 -g -Os -pipe -mdynamic-no-pic  conftest.c >&5
configure:10966: $? = 0
configure:10980: result: yes
configure:10984: checking unistd.h presence
configure:10999: gcc -E  conftest.c
configure:11006: $? = 0
configure:11020: result: yes
configure:11048: checking for unistd.h
configure:11057: result: yes
configure:10942: checking stropts.h usability
configure:10959: gcc -c -arch i386 -arch x86_64 -g -Os -pipe -mdynamic-no-pic  conftest.c >&5
conftest.c:67:21: error: stropts.h: No such file or directory
conftest.c:67:21: error: stropts.h: No such file or directory
lipo: can't open input file: /var/folders/IQ/IQuL0Q24Fna8hK1dP+jLgU+++TM/-Tmp-//ccYdjzDb.out (No such file or directory)
configure:10966: $? = 1
configure: failed program was:
| /* confdefs.h.  */
| #define PACKAGE_NAME ""
| #define PACKAGE_TARNAME ""
| #define PACKAGE_VERSION ""
| #define PACKAGE_STRING ""
| #define PACKAGE_BUGREPORT ""
| #define UNIX 1
| #define STDC_HEADERS 1
| #define HAVE_SYS_WAIT_H 1
| #define FEAT_NORMAL 1
| #define USE_XSMP_INTERACT 1
| #define FEAT_CSCOPE 1
| #define FEAT_NETBEANS_INTG 1
| #define FEAT_MBYTE 1
| #define HAVE_X11_SM_SMLIB_H 1
| #define HAVE_DATE_TIME 1
| #define HAVE_DIRENT_H 1
| #define HAVE_STDARG_H 1
| #define HAVE_STDLIB_H 1
| #define HAVE_STRING_H 1
| #define HAVE_SYS_SELECT_H 1
| #define HAVE_SYS_UTSNAME_H 1
| #define HAVE_TERMCAP_H 1
| #define HAVE_FCNTL_H 1
| #define HAVE_SGTTY_H 1
| #define HAVE_SYS_IOCTL_H 1
| #define HAVE_SYS_TIME_H 1
| #define HAVE_SYS_TYPES_H 1
| #define HAVE_ICONV_H 1
| #define HAVE_LANGINFO_H 1
| #define HAVE_MATH_H 1
| #define HAVE_UNISTD_H 1
| /* end confdefs.h.  */
| #include <stdio.h>
| #ifdef HAVE_SYS_TYPES_H
| # include <sys/types.h>
| #endif
| #ifdef HAVE_SYS_STAT_H
| # include <sys/stat.h>
| #endif
| #ifdef STDC_HEADERS
| # include <stdlib.h>
| # include <stddef.h>
| #else
| # ifdef HAVE_STDLIB_H
| #  include <stdlib.h>
| # endif
| #endif
| #ifdef HAVE_STRING_H
| # if !defined STDC_HEADERS && defined HAVE_MEMORY_H
| #  include <memory.h>
| # endif
| # include <string.h>
| #endif
| #ifdef HAVE_STRINGS_H
| # include <strings.h>
| #endif
| #ifdef HAVE_INTTYPES_H
| # include <inttypes.h>
| #endif
| #ifdef HAVE_STDINT_H
| # include <stdint.h>
| #endif
| #ifdef HAVE_UNISTD_H
| # include <unistd.h>
| #endif
| #include <stropts.h>
configure:10980: result: no
configure:10984: checking stropts.h presence
configure:10999: gcc -E  conftest.c
conftest.c:34:21: error: stropts.h: No such file or directory
configure:11006: $? = 1
configure: failed program was:
| /* confdefs.h.  */
| #define PACKAGE_NAME ""
| #define PACKAGE_TARNAME ""
| #define PACKAGE_VERSION ""
| #define PACKAGE_STRING ""
| #define PACKAGE_BUGREPORT ""
| #define UNIX 1
| #define STDC_HEADERS 1
| #define HAVE_SYS_WAIT_H 1
| #define FEAT_NORMAL 1
| #define USE_XSMP_INTERACT 1
| #define FEAT_CSCOPE 1
| #define FEAT_NETBEANS_INTG 1
| #define FEAT_MBYTE 1
| #define HAVE_X11_SM_SMLIB_H 1
| #define HAVE_DATE_TIME 1
| #define HAVE_DIRENT_H 1
| #define HAVE_STDARG_H 1
| #define HAVE_STDLIB_H 1
| #define HAVE_STRING_H 1
| #define HAVE_SYS_SELECT_H 1
| #define HAVE_SYS_UTSNAME_H 1
| #define HAVE_TERMCAP_H 1
| #define HAVE_FCNTL_H 1
| #define HAVE_SGTTY_H 1
| #define HAVE_SYS_IOCTL_H 1
| #define HAVE_SYS_TIME_H 1
| #define HAVE_SYS_TYPES_H 1
| #define HAVE_ICONV_H 1
| #define HAVE_LANGINFO_H 1
| #define HAVE_MATH_H 1
| #define HAVE_UNISTD_H 1
| /* end confdefs.h.  */
| #include <stropts.h>
configure:11020: result: no
configure:11048: checking for stropts.h
configure:11057: result: no
configure:10942: checking errno.h usability
configure:10959: gcc -c -arch i386 -arch x86_64 -g -Os -pipe -mdynamic-no-pic  conftest.c >&5
configure:10966: $? = 0
configure:10980: result: yes
configure:10984: checking errno.h presence
configure:10999: gcc -E  conftest.c
configure:11006: $? = 0
configure:11020: result: yes
configure:11048: checking for errno.h
configure:11057: result: yes
configure:10942: checking sys/resource.h usability
configure:10959: gcc -c -arch i386 -arch x86_64 -g -Os -pipe -mdynamic-no-pic  conftest.c >&5
configure:10966: $? = 0
configure:10980: result: yes
configure:10984: checking sys/resource.h presence
configure:10999: gcc -E  conftest.c
configure:11006: $? = 0
configure:11020: result: yes
configure:11048: checking for sys/resource.h
configure:11057: result: yes
configure:10942: checking sys/systeminfo.h usability
configure:10959: gcc -c -arch i386 -arch x86_64 -g -Os -pipe -mdynamic-no-pic  conftest.c >&5
conftest.c:69:28: error: sys/systeminfo.h: No such file or directory
conftest.c:69:28: error: sys/systeminfo.h: No such file or directory
lipo: can't open input file: /var/folders/IQ/IQuL0Q24Fna8hK1dP+jLgU+++TM/-Tmp-//ccXhmXun.out (No such file or directory)
configure:10966: $? = 1
configure: failed program was:
| /* confdefs.h.  */
| #define PACKAGE_NAME ""
| #define PACKAGE_TARNAME ""
| #define PACKAGE_VERSION ""
| #define PACKAGE_STRING ""
| #define PACKAGE_BUGREPORT ""
| #define UNIX 1
| #define STDC_HEADERS 1
| #define HAVE_SYS_WAIT_H 1
| #define FEAT_NORMAL 1
| #define USE_XSMP_INTERACT 1
| #define FEAT_CSCOPE 1
| #define FEAT_NETBEANS_INTG 1
| #define FEAT_MBYTE 1
| #define HAVE_X11_SM_SMLIB_H 1
| #define HAVE_DATE_TIME 1
| #define HAVE_DIRENT_H 1
| #define HAVE_STDARG_H 1
| #define HAVE_STDLIB_H 1
| #define HAVE_STRING_H 1
| #define HAVE_SYS_SELECT_H 1
| #define HAVE_SYS_UTSNAME_H 1
| #define HAVE_TERMCAP_H 1
| #define HAVE_FCNTL_H 1
| #define HAVE_SGTTY_H 1
| #define HAVE_SYS_IOCTL_H 1
| #define HAVE_SYS_TIME_H 1
| #define HAVE_SYS_TYPES_H 1
| #define HAVE_ICONV_H 1
| #define HAVE_LANGINFO_H 1
| #define HAVE_MATH_H 1
| #define HAVE_UNISTD_H 1
| #define HAVE_ERRNO_H 1
| #define HAVE_SYS_RESOURCE_H 1
| /* end confdefs.h.  */
| #include <stdio.h>
| #ifdef HAVE_SYS_TYPES_H
| # include <sys/types.h>
| #endif
| #ifdef HAVE_SYS_STAT_H
| # include <sys/stat.h>
| #endif
| #ifdef STDC_HEADERS
| # include <stdlib.h>
| # include <stddef.h>
| #else
| # ifdef HAVE_STDLIB_H
| #  include <stdlib.h>
| # endif
| #endif
| #ifdef HAVE_STRING_H
| # if !defined STDC_HEADERS && defined HAVE_MEMORY_H
| #  include <memory.h>
| # endif
| # include <string.h>
| #endif
| #ifdef HAVE_STRINGS_H
| # include <strings.h>
| #endif
| #ifdef HAVE_INTTYPES_H
| # include <inttypes.h>
| #endif
| #ifdef HAVE_STDINT_H
| # include <stdint.h>
| #endif
| #ifdef HAVE_UNISTD_H
| # include <unistd.h>
| #endif
| #include <sys/systeminfo.h>
configure:10980: result: no
configure:10984: checking sys/systeminfo.h presence
configure:10999: gcc -E  conftest.c
conftest.c:36:28: error: sys/systeminfo.h: No such file or directory
configure:11006: $? = 1
configure: failed program was:
| /* confdefs.h.  */
| #define PACKAGE_NAME ""
| #define PACKAGE_TARNAME ""
| #define PACKAGE_VERSION ""
| #define PACKAGE_STRING ""
| #define PACKAGE_BUGREPORT ""
| #define UNIX 1
| #define STDC_HEADERS 1
| #define HAVE_SYS_WAIT_H 1
| #define FEAT_NORMAL 1
| #define USE_XSMP_INTERACT 1
| #define FEAT_CSCOPE 1
| #define FEAT_NETBEANS_INTG 1
| #define FEAT_MBYTE 1
| #define HAVE_X11_SM_SMLIB_H 1
| #define HAVE_DATE_TIME 1
| #define HAVE_DIRENT_H 1
| #define HAVE_STDARG_H 1
| #define HAVE_STDLIB_H 1
| #define HAVE_STRING_H 1
| #define HAVE_SYS_SELECT_H 1
| #define HAVE_SYS_UTSNAME_H 1
| #define HAVE_TERMCAP_H 1
| #define HAVE_FCNTL_H 1
| #define HAVE_SGTTY_H 1
| #define HAVE_SYS_IOCTL_H 1
| #define HAVE_SYS_TIME_H 1
| #define HAVE_SYS_TYPES_H 1
| #define HAVE_ICONV_H 1
| #define HAVE_LANGINFO_H 1
| #define HAVE_MATH_H 1
| #define HAVE_UNISTD_H 1
| #define HAVE_ERRNO_H 1
| #define HAVE_SYS_RESOURCE_H 1
| /* end confdefs.h.  */
| #include <sys/systeminfo.h>
configure:11020: result: no
configure:11048: checking for sys/systeminfo.h
configure:11057: result: no
configure:10942: checking locale.h usability
configure:10959: gcc -c -arch i386 -arch x86_64 -g -Os -pipe -mdynamic-no-pic  conftest.c >&5
configure:10966: $? = 0
configure:10980: result: yes
configure:10984: checking locale.h presence
configure:10999: gcc -E  conftest.c
configure:11006: $? = 0
configure:11020: result: yes
configure:11048: checking for locale.h
configure:11057: result: yes
configure:10942: checking sys/stream.h usability
configure:10959: gcc -c -arch i386 -arch x86_64 -g -Os -pipe -mdynamic-no-pic  conftest.c >&5
conftest.c:70:24: error: sys/stream.h: No such file or directory
conftest.c:70:24: error: sys/stream.h: No such file or directory
lipo: can't open input file: /var/folders/IQ/IQuL0Q24Fna8hK1dP+jLgU+++TM/-Tmp-//cctzswUj.out (No such file or directory)
configure:10966: $? = 1
configure: failed program was:
| /* confdefs.h.  */
| #define PACKAGE_NAME ""
| #define PACKAGE_TARNAME ""
| #define PACKAGE_VERSION ""
| #define PACKAGE_STRING ""
| #define PACKAGE_BUGREPORT ""
| #define UNIX 1
| #define STDC_HEADERS 1
| #define HAVE_SYS_WAIT_H 1
| #define FEAT_NORMAL 1
| #define USE_XSMP_INTERACT 1
| #define FEAT_CSCOPE 1
| #define FEAT_NETBEANS_INTG 1
| #define FEAT_MBYTE 1
| #define HAVE_X11_SM_SMLIB_H 1
| #define HAVE_DATE_TIME 1
| #define HAVE_DIRENT_H 1
| #define HAVE_STDARG_H 1
| #define HAVE_STDLIB_H 1
| #define HAVE_STRING_H 1
| #define HAVE_SYS_SELECT_H 1
| #define HAVE_SYS_UTSNAME_H 1
| #define HAVE_TERMCAP_H 1
| #define HAVE_FCNTL_H 1
| #define HAVE_SGTTY_H 1
| #define HAVE_SYS_IOCTL_H 1
| #define HAVE_SYS_TIME_H 1
| #define HAVE_SYS_TYPES_H 1
| #define HAVE_ICONV_H 1
| #define HAVE_LANGINFO_H 1
| #define HAVE_MATH_H 1
| #define HAVE_UNISTD_H 1
| #define HAVE_ERRNO_H 1
| #define HAVE_SYS_RESOURCE_H 1
| #define HAVE_LOCALE_H 1
| /* end confdefs.h.  */
| #include <stdio.h>
| #ifdef HAVE_SYS_TYPES_H
| # include <sys/types.h>
| #endif
| #ifdef HAVE_SYS_STAT_H
| # include <sys/stat.h>
| #endif
| #ifdef STDC_HEADERS
| # include <stdlib.h>
| # include <stddef.h>
| #else
| # ifdef HAVE_STDLIB_H
| #  include <stdlib.h>
| # endif
| #endif
| #ifdef HAVE_STRING_H
| # if !defined STDC_HEADERS && defined HAVE_MEMORY_H
| #  include <memory.h>
| # endif
| # include <string.h>
| #endif
| #ifdef HAVE_STRINGS_H
| # include <strings.h>
| #endif
| #ifdef HAVE_INTTYPES_H
| # include <inttypes.h>
| #endif
| #ifdef HAVE_STDINT_H
| # include <stdint.h>
| #endif
| #ifdef HAVE_UNISTD_H
| # include <unistd.h>
| #endif
| #include <sys/stream.h>
configure:10980: result: no
configure:10984: checking sys/stream.h presence
configure:10999: gcc -E  conftest.c
conftest.c:37:24: error: sys/stream.h: No such file or directory
configure:11006: $? = 1
configure: failed program was:
| /* confdefs.h.  */
| #define PACKAGE_NAME ""
| #define PACKAGE_TARNAME ""
| #define PACKAGE_VERSION ""
| #define PACKAGE_STRING ""
| #define PACKAGE_BUGREPORT ""
| #define UNIX 1
| #define STDC_HEADERS 1
| #define HAVE_SYS_WAIT_H 1
| #define FEAT_NORMAL 1
| #define USE_XSMP_INTERACT 1
| #define FEAT_CSCOPE 1
| #define FEAT_NETBEANS_INTG 1
| #define FEAT_MBYTE 1
| #define HAVE_X11_SM_SMLIB_H 1
| #define HAVE_DATE_TIME 1
| #define HAVE_DIRENT_H 1
| #define HAVE_STDARG_H 1
| #define HAVE_STDLIB_H 1
| #define HAVE_STRING_H 1
| #define HAVE_SYS_SELECT_H 1
| #define HAVE_SYS_UTSNAME_H 1
| #define HAVE_TERMCAP_H 1
| #define HAVE_FCNTL_H 1
| #define HAVE_SGTTY_H 1
| #define HAVE_SYS_IOCTL_H 1
| #define HAVE_SYS_TIME_H 1
| #define HAVE_SYS_TYPES_H 1
| #define HAVE_ICONV_H 1
| #define HAVE_LANGINFO_H 1
| #define HAVE_MATH_H 1
| #define HAVE_UNISTD_H 1
| #define HAVE_ERRNO_H 1
| #define HAVE_SYS_RESOURCE_H 1
| #define HAVE_LOCALE_H 1
| /* end confdefs.h.  */
| #include <sys/stream.h>
configure:11020: result: no
configure:11048: checking for sys/stream.h
configure:11057: result: no
configure:10942: checking termios.h usability
configure:10959: gcc -c -arch i386 -arch x86_64 -g -Os -pipe -mdynamic-no-pic  conftest.c >&5
configure:10966: $? = 0
configure:10980: result: yes
configure:10984: checking termios.h presence
configure:10999: gcc -E  conftest.c
configure:11006: $? = 0
configure:11020: result: yes
configure:11048: checking for termios.h
configure:11057: result: yes
configure:10942: checking libc.h usability
configure:10959: gcc -c -arch i386 -arch x86_64 -g -Os -pipe -mdynamic-no-pic  conftest.c >&5
configure:10966: $? = 0
configure:10980: result: yes
configure:10984: checking libc.h presence
configure:10999: gcc -E  conftest.c
configure:11006: $? = 0
configure:11020: result: yes
configure:11048: checking for libc.h
configure:11057: result: yes
configure:10942: checking sys/statfs.h usability
configure:10959: gcc -c -arch i386 -arch x86_64 -g -Os -pipe -mdynamic-no-pic  conftest.c >&5
conftest.c:72:24: error: sys/statfs.h: No such file or directory
conftest.c:72:24: error: sys/statfs.h: No such file or directory
lipo: can't open input file: /var/folders/IQ/IQuL0Q24Fna8hK1dP+jLgU+++TM/-Tmp-//ccHCAbUC.out (No such file or directory)
configure:10966: $? = 1
configure: failed program was:
| /* confdefs.h.  */
| #define PACKAGE_NAME ""
| #define PACKAGE_TARNAME ""
| #define PACKAGE_VERSION ""
| #define PACKAGE_STRING ""
| #define PACKAGE_BUGREPORT ""
| #define UNIX 1
| #define STDC_HEADERS 1
| #define HAVE_SYS_WAIT_H 1
| #define FEAT_NORMAL 1
| #define USE_XSMP_INTERACT 1
| #define FEAT_CSCOPE 1
| #define FEAT_NETBEANS_INTG 1
| #define FEAT_MBYTE 1
| #define HAVE_X11_SM_SMLIB_H 1
| #define HAVE_DATE_TIME 1
| #define HAVE_DIRENT_H 1
| #define HAVE_STDARG_H 1
| #define HAVE_STDLIB_H 1
| #define HAVE_STRING_H 1
| #define HAVE_SYS_SELECT_H 1
| #define HAVE_SYS_UTSNAME_H 1
| #define HAVE_TERMCAP_H 1
| #define HAVE_FCNTL_H 1
| #define HAVE_SGTTY_H 1
| #define HAVE_SYS_IOCTL_H 1
| #define HAVE_SYS_TIME_H 1
| #define HAVE_SYS_TYPES_H 1
| #define HAVE_ICONV_H 1
| #define HAVE_LANGINFO_H 1
| #define HAVE_MATH_H 1
| #define HAVE_UNISTD_H 1
| #define HAVE_ERRNO_H 1
| #define HAVE_SYS_RESOURCE_H 1
| #define HAVE_LOCALE_H 1
| #define HAVE_TERMIOS_H 1
| #define HAVE_LIBC_H 1
| /* end confdefs.h.  */
| #include <stdio.h>
| #ifdef HAVE_SYS_TYPES_H
| # include <sys/types.h>
| #endif
| #ifdef HAVE_SYS_STAT_H
| # include <sys/stat.h>
| #endif
| #ifdef STDC_HEADERS
| # include <stdlib.h>
| # include <stddef.h>
| #else
| # ifdef HAVE_STDLIB_H
| #  include <stdlib.h>
| # endif
| #endif
| #ifdef HAVE_STRING_H
| # if !defined STDC_HEADERS && defined HAVE_MEMORY_H
| #  include <memory.h>
| # endif
| # include <string.h>
| #endif
| #ifdef HAVE_STRINGS_H
| # include <strings.h>
| #endif
| #ifdef HAVE_INTTYPES_H
| # include <inttypes.h>
| #endif
| #ifdef HAVE_STDINT_H
| # include <stdint.h>
| #endif
| #ifdef HAVE_UNISTD_H
| # include <unistd.h>
| #endif
| #include <sys/statfs.h>
configure:10980: result: no
configure:10984: checking sys/statfs.h presence
configure:10999: gcc -E  conftest.c
conftest.c:39:24: error: sys/statfs.h: No such file or directory
configure:11006: $? = 1
configure: failed program was:
| /* confdefs.h.  */
| #define PACKAGE_NAME ""
| #define PACKAGE_TARNAME ""
| #define PACKAGE_VERSION ""
| #define PACKAGE_STRING ""
| #define PACKAGE_BUGREPORT ""
| #define UNIX 1
| #define STDC_HEADERS 1
| #define HAVE_SYS_WAIT_H 1
| #define FEAT_NORMAL 1
| #define USE_XSMP_INTERACT 1
| #define FEAT_CSCOPE 1
| #define FEAT_NETBEANS_INTG 1
| #define FEAT_MBYTE 1
| #define HAVE_X11_SM_SMLIB_H 1
| #define HAVE_DATE_TIME 1
| #define HAVE_DIRENT_H 1
| #define HAVE_STDARG_H 1
| #define HAVE_STDLIB_H 1
| #define HAVE_STRING_H 1
| #define HAVE_SYS_SELECT_H 1
| #define HAVE_SYS_UTSNAME_H 1
| #define HAVE_TERMCAP_H 1
| #define HAVE_FCNTL_H 1
| #define HAVE_SGTTY_H 1
| #define HAVE_SYS_IOCTL_H 1
| #define HAVE_SYS_TIME_H 1
| #define HAVE_SYS_TYPES_H 1
| #define HAVE_ICONV_H 1
| #define HAVE_LANGINFO_H 1
| #define HAVE_MATH_H 1
| #define HAVE_UNISTD_H 1
| #define HAVE_ERRNO_H 1
| #define HAVE_SYS_RESOURCE_H 1
| #define HAVE_LOCALE_H 1
| #define HAVE_TERMIOS_H 1
| #define HAVE_LIBC_H 1
| /* end confdefs.h.  */
| #include <sys/statfs.h>
configure:11020: result: no
configure:11048: checking for sys/statfs.h
configure:11057: result: no
configure:10942: checking poll.h usability
configure:10959: gcc -c -arch i386 -arch x86_64 -g -Os -pipe -mdynamic-no-pic  conftest.c >&5
configure:10966: $? = 0
configure:10980: result: yes
configure:10984: checking poll.h presence
configure:10999: gcc -E  conftest.c
configure:11006: $? = 0
configure:11020: result: yes
configure:11048: checking for poll.h
configure:11057: result: yes
configure:10942: checking sys/poll.h usability
configure:10959: gcc -c -arch i386 -arch x86_64 -g -Os -pipe -mdynamic-no-pic  conftest.c >&5
configure:10966: $? = 0
configure:10980: result: yes
configure:10984: checking sys/poll.h presence
configure:10999: gcc -E  conftest.c
configure:11006: $? = 0
configure:11020: result: yes
configure:11048: checking for sys/poll.h
configure:11057: result: yes
configure:10942: checking pwd.h usability
configure:10959: gcc -c -arch i386 -arch x86_64 -g -Os -pipe -mdynamic-no-pic  conftest.c >&5
configure:10966: $? = 0
configure:10980: result: yes
configure:10984: checking pwd.h presence
configure:10999: gcc -E  conftest.c
configure:11006: $? = 0
configure:11020: result: yes
configure:11048: checking for pwd.h
configure:11057: result: yes
configure:10942: checking utime.h usability
configure:10959: gcc -c -arch i386 -arch x86_64 -g -Os -pipe -mdynamic-no-pic  conftest.c >&5
configure:10966: $? = 0
configure:10980: result: yes
configure:10984: checking utime.h presence
configure:10999: gcc -E  conftest.c
configure:11006: $? = 0
configure:11020: result: yes
configure:11048: checking for utime.h
configure:11057: result: yes
configure:10942: checking sys/param.h usability
configure:10959: gcc -c -arch i386 -arch x86_64 -g -Os -pipe -mdynamic-no-pic  conftest.c >&5
configure:10966: $? = 0
configure:10980: result: yes
configure:10984: checking sys/param.h presence
configure:10999: gcc -E  conftest.c
configure:11006: $? = 0
configure:11020: result: yes
configure:11048: checking for sys/param.h
configure:11057: result: yes
configure:10942: checking libintl.h usability
configure:10959: gcc -c -arch i386 -arch x86_64 -g -Os -pipe -mdynamic-no-pic  conftest.c >&5
conftest.c:77:21: error: libintl.h: No such file or directory
conftest.c:77:21: error: libintl.h: No such file or directory
lipo: can't open input file: /var/folders/IQ/IQuL0Q24Fna8hK1dP+jLgU+++TM/-Tmp-//cc0TrwDY.out (No such file or directory)
configure:10966: $? = 1
configure: failed program was:
| /* confdefs.h.  */
| #define PACKAGE_NAME ""
| #define PACKAGE_TARNAME ""
| #define PACKAGE_VERSION ""
| #define PACKAGE_STRING ""
| #define PACKAGE_BUGREPORT ""
| #define UNIX 1
| #define STDC_HEADERS 1
| #define HAVE_SYS_WAIT_H 1
| #define FEAT_NORMAL 1
| #define USE_XSMP_INTERACT 1
| #define FEAT_CSCOPE 1
| #define FEAT_NETBEANS_INTG 1
| #define FEAT_MBYTE 1
| #define HAVE_X11_SM_SMLIB_H 1
| #define HAVE_DATE_TIME 1
| #define HAVE_DIRENT_H 1
| #define HAVE_STDARG_H 1
| #define HAVE_STDLIB_H 1
| #define HAVE_STRING_H 1
| #define HAVE_SYS_SELECT_H 1
| #define HAVE_SYS_UTSNAME_H 1
| #define HAVE_TERMCAP_H 1
| #define HAVE_FCNTL_H 1
| #define HAVE_SGTTY_H 1
| #define HAVE_SYS_IOCTL_H 1
| #define HAVE_SYS_TIME_H 1
| #define HAVE_SYS_TYPES_H 1
| #define HAVE_ICONV_H 1
| #define HAVE_LANGINFO_H 1
| #define HAVE_MATH_H 1
| #define HAVE_UNISTD_H 1
| #define HAVE_ERRNO_H 1
| #define HAVE_SYS_RESOURCE_H 1
| #define HAVE_LOCALE_H 1
| #define HAVE_TERMIOS_H 1
| #define HAVE_LIBC_H 1
| #define HAVE_POLL_H 1
| #define HAVE_SYS_POLL_H 1
| #define HAVE_PWD_H 1
| #define HAVE_UTIME_H 1
| #define HAVE_SYS_PARAM_H 1
| /* end confdefs.h.  */
| #include <stdio.h>
| #ifdef HAVE_SYS_TYPES_H
| # include <sys/types.h>
| #endif
| #ifdef HAVE_SYS_STAT_H
| # include <sys/stat.h>
| #endif
| #ifdef STDC_HEADERS
| # include <stdlib.h>
| # include <stddef.h>
| #else
| # ifdef HAVE_STDLIB_H
| #  include <stdlib.h>
| # endif
| #endif
| #ifdef HAVE_STRING_H
| # if !defined STDC_HEADERS && defined HAVE_MEMORY_H
| #  include <memory.h>
| # endif
| # include <string.h>
| #endif
| #ifdef HAVE_STRINGS_H
| # include <strings.h>
| #endif
| #ifdef HAVE_INTTYPES_H
| # include <inttypes.h>
| #endif
| #ifdef HAVE_STDINT_H
| # include <stdint.h>
| #endif
| #ifdef HAVE_UNISTD_H
| # include <unistd.h>
| #endif
| #include <libintl.h>
configure:10980: result: no
configure:10984: checking libintl.h presence
configure:10999: gcc -E  conftest.c
conftest.c:44:21: error: libintl.h: No such file or directory
configure:11006: $? = 1
configure: failed program was:
| /* confdefs.h.  */
| #define PACKAGE_NAME ""
| #define PACKAGE_TARNAME ""
| #define PACKAGE_VERSION ""
| #define PACKAGE_STRING ""
| #define PACKAGE_BUGREPORT ""
| #define UNIX 1
| #define STDC_HEADERS 1
| #define HAVE_SYS_WAIT_H 1
| #define FEAT_NORMAL 1
| #define USE_XSMP_INTERACT 1
| #define FEAT_CSCOPE 1
| #define FEAT_NETBEANS_INTG 1
| #define FEAT_MBYTE 1
| #define HAVE_X11_SM_SMLIB_H 1
| #define HAVE_DATE_TIME 1
| #define HAVE_DIRENT_H 1
| #define HAVE_STDARG_H 1
| #define HAVE_STDLIB_H 1
| #define HAVE_STRING_H 1
| #define HAVE_SYS_SELECT_H 1
| #define HAVE_SYS_UTSNAME_H 1
| #define HAVE_TERMCAP_H 1
| #define HAVE_FCNTL_H 1
| #define HAVE_SGTTY_H 1
| #define HAVE_SYS_IOCTL_H 1
| #define HAVE_SYS_TIME_H 1
| #define HAVE_SYS_TYPES_H 1
| #define HAVE_ICONV_H 1
| #define HAVE_LANGINFO_H 1
| #define HAVE_MATH_H 1
| #define HAVE_UNISTD_H 1
| #define HAVE_ERRNO_H 1
| #define HAVE_SYS_RESOURCE_H 1
| #define HAVE_LOCALE_H 1
| #define HAVE_TERMIOS_H 1
| #define HAVE_LIBC_H 1
| #define HAVE_POLL_H 1
| #define HAVE_SYS_POLL_H 1
| #define HAVE_PWD_H 1
| #define HAVE_UTIME_H 1
| #define HAVE_SYS_PARAM_H 1
| /* end confdefs.h.  */
| #include <libintl.h>
configure:11020: result: no
configure:11048: checking for libintl.h
configure:11057: result: no
configure:10942: checking libgen.h usability
configure:10959: gcc -c -arch i386 -arch x86_64 -g -Os -pipe -mdynamic-no-pic  conftest.c >&5
configure:10966: $? = 0
configure:10980: result: yes
configure:10984: checking libgen.h presence
configure:10999: gcc -E  conftest.c
configure:11006: $? = 0
configure:11020: result: yes
configure:11048: checking for libgen.h
configure:11057: result: yes
configure:10942: checking util/debug.h usability
configure:10959: gcc -c -arch i386 -arch x86_64 -g -Os -pipe -mdynamic-no-pic  conftest.c >&5
conftest.c:78:24: error: util/debug.h: No such file or directory
conftest.c:78:24: error: util/debug.h: No such file or directory
lipo: can't open input file: /var/folders/IQ/IQuL0Q24Fna8hK1dP+jLgU+++TM/-Tmp-//ccYwwJwH.out (No such file or directory)
configure:10966: $? = 1
configure: failed program was:
| /* confdefs.h.  */
| #define PACKAGE_NAME ""
| #define PACKAGE_TARNAME ""
| #define PACKAGE_VERSION ""
| #define PACKAGE_STRING ""
| #define PACKAGE_BUGREPORT ""
| #define UNIX 1
| #define STDC_HEADERS 1
| #define HAVE_SYS_WAIT_H 1
| #define FEAT_NORMAL 1
| #define USE_XSMP_INTERACT 1
| #define FEAT_CSCOPE 1
| #define FEAT_NETBEANS_INTG 1
| #define FEAT_MBYTE 1
| #define HAVE_X11_SM_SMLIB_H 1
| #define HAVE_DATE_TIME 1
| #define HAVE_DIRENT_H 1
| #define HAVE_STDARG_H 1
| #define HAVE_STDLIB_H 1
| #define HAVE_STRING_H 1
| #define HAVE_SYS_SELECT_H 1
| #define HAVE_SYS_UTSNAME_H 1
| #define HAVE_TERMCAP_H 1
| #define HAVE_FCNTL_H 1
| #define HAVE_SGTTY_H 1
| #define HAVE_SYS_IOCTL_H 1
| #define HAVE_SYS_TIME_H 1
| #define HAVE_SYS_TYPES_H 1
| #define HAVE_ICONV_H 1
| #define HAVE_LANGINFO_H 1
| #define HAVE_MATH_H 1
| #define HAVE_UNISTD_H 1
| #define HAVE_ERRNO_H 1
| #define HAVE_SYS_RESOURCE_H 1
| #define HAVE_LOCALE_H 1
| #define HAVE_TERMIOS_H 1
| #define HAVE_LIBC_H 1
| #define HAVE_POLL_H 1
| #define HAVE_SYS_POLL_H 1
| #define HAVE_PWD_H 1
| #define HAVE_UTIME_H 1
| #define HAVE_SYS_PARAM_H 1
| #define HAVE_LIBGEN_H 1
| /* end confdefs.h.  */
| #include <stdio.h>
| #ifdef HAVE_SYS_TYPES_H
| # include <sys/types.h>
| #endif
| #ifdef HAVE_SYS_STAT_H
| # include <sys/stat.h>
| #endif
| #ifdef STDC_HEADERS
| # include <stdlib.h>
| # include <stddef.h>
| #else
| # ifdef HAVE_STDLIB_H
| #  include <stdlib.h>
| # endif
| #endif
| #ifdef HAVE_STRING_H
| # if !defined STDC_HEADERS && defined HAVE_MEMORY_H
| #  include <memory.h>
| # endif
| # include <string.h>
| #endif
| #ifdef HAVE_STRINGS_H
| # include <strings.h>
| #endif
| #ifdef HAVE_INTTYPES_H
| # include <inttypes.h>
| #endif
| #ifdef HAVE_STDINT_H
| # include <stdint.h>
| #endif
| #ifdef HAVE_UNISTD_H
| # include <unistd.h>
| #endif
| #include <util/debug.h>
configure:10980: result: no
configure:10984: checking util/debug.h presence
configure:10999: gcc -E  conftest.c
conftest.c:45:24: error: util/debug.h: No such file or directory
configure:11006: $? = 1
configure: failed program was:
| /* confdefs.h.  */
| #define PACKAGE_NAME ""
| #define PACKAGE_TARNAME ""
| #define PACKAGE_VERSION ""
| #define PACKAGE_STRING ""
| #define PACKAGE_BUGREPORT ""
| #define UNIX 1
| #define STDC_HEADERS 1
| #define HAVE_SYS_WAIT_H 1
| #define FEAT_NORMAL 1
| #define USE_XSMP_INTERACT 1
| #define FEAT_CSCOPE 1
| #define FEAT_NETBEANS_INTG 1
| #define FEAT_MBYTE 1
| #define HAVE_X11_SM_SMLIB_H 1
| #define HAVE_DATE_TIME 1
| #define HAVE_DIRENT_H 1
| #define HAVE_STDARG_H 1
| #define HAVE_STDLIB_H 1
| #define HAVE_STRING_H 1
| #define HAVE_SYS_SELECT_H 1
| #define HAVE_SYS_UTSNAME_H 1
| #define HAVE_TERMCAP_H 1
| #define HAVE_FCNTL_H 1
| #define HAVE_SGTTY_H 1
| #define HAVE_SYS_IOCTL_H 1
| #define HAVE_SYS_TIME_H 1
| #define HAVE_SYS_TYPES_H 1
| #define HAVE_ICONV_H 1
| #define HAVE_LANGINFO_H 1
| #define HAVE_MATH_H 1
| #define HAVE_UNISTD_H 1
| #define HAVE_ERRNO_H 1
| #define HAVE_SYS_RESOURCE_H 1
| #define HAVE_LOCALE_H 1
| #define HAVE_TERMIOS_H 1
| #define HAVE_LIBC_H 1
| #define HAVE_POLL_H 1
| #define HAVE_SYS_POLL_H 1
| #define HAVE_PWD_H 1
| #define HAVE_UTIME_H 1
| #define HAVE_SYS_PARAM_H 1
| #define HAVE_LIBGEN_H 1
| /* end confdefs.h.  */
| #include <util/debug.h>
configure:11020: result: no
configure:11048: checking for util/debug.h
configure:11057: result: no
configure:10942: checking util/msg18n.h usability
configure:10959: gcc -c -arch i386 -arch x86_64 -g -Os -pipe -mdynamic-no-pic  conftest.c >&5
conftest.c:78:25: error: util/msg18n.h: No such file or directory
conftest.c:78:25: error: util/msg18n.h: No such file or directory
lipo: can't open input file: /var/folders/IQ/IQuL0Q24Fna8hK1dP+jLgU+++TM/-Tmp-//ccow6uSu.out (No such file or directory)
configure:10966: $? = 1
configure: failed program was:
| /* confdefs.h.  */
| #define PACKAGE_NAME ""
| #define PACKAGE_TARNAME ""
| #define PACKAGE_VERSION ""
| #define PACKAGE_STRING ""
| #define PACKAGE_BUGREPORT ""
| #define UNIX 1
| #define STDC_HEADERS 1
| #define HAVE_SYS_WAIT_H 1
| #define FEAT_NORMAL 1
| #define USE_XSMP_INTERACT 1
| #define FEAT_CSCOPE 1
| #define FEAT_NETBEANS_INTG 1
| #define FEAT_MBYTE 1
| #define HAVE_X11_SM_SMLIB_H 1
| #define HAVE_DATE_TIME 1
| #define HAVE_DIRENT_H 1
| #define HAVE_STDARG_H 1
| #define HAVE_STDLIB_H 1
| #define HAVE_STRING_H 1
| #define HAVE_SYS_SELECT_H 1
| #define HAVE_SYS_UTSNAME_H 1
| #define HAVE_TERMCAP_H 1
| #define HAVE_FCNTL_H 1
| #define HAVE_SGTTY_H 1
| #define HAVE_SYS_IOCTL_H 1
| #define HAVE_SYS_TIME_H 1
| #define HAVE_SYS_TYPES_H 1
| #define HAVE_ICONV_H 1
| #define HAVE_LANGINFO_H 1
| #define HAVE_MATH_H 1
| #define HAVE_UNISTD_H 1
| #define HAVE_ERRNO_H 1
| #define HAVE_SYS_RESOURCE_H 1
| #define HAVE_LOCALE_H 1
| #define HAVE_TERMIOS_H 1
| #define HAVE_LIBC_H 1
| #define HAVE_POLL_H 1
| #define HAVE_SYS_POLL_H 1
| #define HAVE_PWD_H 1
| #define HAVE_UTIME_H 1
| #define HAVE_SYS_PARAM_H 1
| #define HAVE_LIBGEN_H 1
| /* end confdefs.h.  */
| #include <stdio.h>
| #ifdef HAVE_SYS_TYPES_H
| # include <sys/types.h>
| #endif
| #ifdef HAVE_SYS_STAT_H
| # include <sys/stat.h>
| #endif
| #ifdef STDC_HEADERS
| # include <stdlib.h>
| # include <stddef.h>
| #else
| # ifdef HAVE_STDLIB_H
| #  include <stdlib.h>
| # endif
| #endif
| #ifdef HAVE_STRING_H
| # if !defined STDC_HEADERS && defined HAVE_MEMORY_H
| #  include <memory.h>
| # endif
| # include <string.h>
| #endif
| #ifdef HAVE_STRINGS_H
| # include <strings.h>
| #endif
| #ifdef HAVE_INTTYPES_H
| # include <inttypes.h>
| #endif
| #ifdef HAVE_STDINT_H
| # include <stdint.h>
| #endif
| #ifdef HAVE_UNISTD_H
| # include <unistd.h>
| #endif
| #include <util/msg18n.h>
configure:10980: result: no
configure:10984: checking util/msg18n.h presence
configure:10999: gcc -E  conftest.c
conftest.c:45:25: error: util/msg18n.h: No such file or directory
configure:11006: $? = 1
configure: failed program was:
| /* confdefs.h.  */
| #define PACKAGE_NAME ""
| #define PACKAGE_TARNAME ""
| #define PACKAGE_VERSION ""
| #define PACKAGE_STRING ""
| #define PACKAGE_BUGREPORT ""
| #define UNIX 1
| #define STDC_HEADERS 1
| #define HAVE_SYS_WAIT_H 1
| #define FEAT_NORMAL 1
| #define USE_XSMP_INTERACT 1
| #define FEAT_CSCOPE 1
| #define FEAT_NETBEANS_INTG 1
| #define FEAT_MBYTE 1
| #define HAVE_X11_SM_SMLIB_H 1
| #define HAVE_DATE_TIME 1
| #define HAVE_DIRENT_H 1
| #define HAVE_STDARG_H 1
| #define HAVE_STDLIB_H 1
| #define HAVE_STRING_H 1
| #define HAVE_SYS_SELECT_H 1
| #define HAVE_SYS_UTSNAME_H 1
| #define HAVE_TERMCAP_H 1
| #define HAVE_FCNTL_H 1
| #define HAVE_SGTTY_H 1
| #define HAVE_SYS_IOCTL_H 1
| #define HAVE_SYS_TIME_H 1
| #define HAVE_SYS_TYPES_H 1
| #define HAVE_ICONV_H 1
| #define HAVE_LANGINFO_H 1
| #define HAVE_MATH_H 1
| #define HAVE_UNISTD_H 1
| #define HAVE_ERRNO_H 1
| #define HAVE_SYS_RESOURCE_H 1
| #define HAVE_LOCALE_H 1
| #define HAVE_TERMIOS_H 1
| #define HAVE_LIBC_H 1
| #define HAVE_POLL_H 1
| #define HAVE_SYS_POLL_H 1
| #define HAVE_PWD_H 1
| #define HAVE_UTIME_H 1
| #define HAVE_SYS_PARAM_H 1
| #define HAVE_LIBGEN_H 1
| /* end confdefs.h.  */
| #include <util/msg18n.h>
configure:11020: result: no
configure:11048: checking for util/msg18n.h
configure:11057: result: no
configure:10942: checking frame.h usability
configure:10959: gcc -c -arch i386 -arch x86_64 -g -Os -pipe -mdynamic-no-pic  conftest.c >&5
conftest.c:78:19: error: frame.h: No such file or directory
conftest.c:78:19: error: frame.h: No such file or directory
lipo: can't open input file: /var/folders/IQ/IQuL0Q24Fna8hK1dP+jLgU+++TM/-Tmp-//ccDnb0XK.out (No such file or directory)
configure:10966: $? = 1
configure: failed program was:
| /* confdefs.h.  */
| #define PACKAGE_NAME ""
| #define PACKAGE_TARNAME ""
| #define PACKAGE_VERSION ""
| #define PACKAGE_STRING ""
| #define PACKAGE_BUGREPORT ""
| #define UNIX 1
| #define STDC_HEADERS 1
| #define HAVE_SYS_WAIT_H 1
| #define FEAT_NORMAL 1
| #define USE_XSMP_INTERACT 1
| #define FEAT_CSCOPE 1
| #define FEAT_NETBEANS_INTG 1
| #define FEAT_MBYTE 1
| #define HAVE_X11_SM_SMLIB_H 1
| #define HAVE_DATE_TIME 1
| #define HAVE_DIRENT_H 1
| #define HAVE_STDARG_H 1
| #define HAVE_STDLIB_H 1
| #define HAVE_STRING_H 1
| #define HAVE_SYS_SELECT_H 1
| #define HAVE_SYS_UTSNAME_H 1
| #define HAVE_TERMCAP_H 1
| #define HAVE_FCNTL_H 1
| #define HAVE_SGTTY_H 1
| #define HAVE_SYS_IOCTL_H 1
| #define HAVE_SYS_TIME_H 1
| #define HAVE_SYS_TYPES_H 1
| #define HAVE_ICONV_H 1
| #define HAVE_LANGINFO_H 1
| #define HAVE_MATH_H 1
| #define HAVE_UNISTD_H 1
| #define HAVE_ERRNO_H 1
| #define HAVE_SYS_RESOURCE_H 1
| #define HAVE_LOCALE_H 1
| #define HAVE_TERMIOS_H 1
| #define HAVE_LIBC_H 1
| #define HAVE_POLL_H 1
| #define HAVE_SYS_POLL_H 1
| #define HAVE_PWD_H 1
| #define HAVE_UTIME_H 1
| #define HAVE_SYS_PARAM_H 1
| #define HAVE_LIBGEN_H 1
| /* end confdefs.h.  */
| #include <stdio.h>
| #ifdef HAVE_SYS_TYPES_H
| # include <sys/types.h>
| #endif
| #ifdef HAVE_SYS_STAT_H
| # include <sys/stat.h>
| #endif
| #ifdef STDC_HEADERS
| # include <stdlib.h>
| # include <stddef.h>
| #else
| # ifdef HAVE_STDLIB_H
| #  include <stdlib.h>
| # endif
| #endif
| #ifdef HAVE_STRING_H
| # if !defined STDC_HEADERS && defined HAVE_MEMORY_H
| #  include <memory.h>
| # endif
| # include <string.h>
| #endif
| #ifdef HAVE_STRINGS_H
| # include <strings.h>
| #endif
| #ifdef HAVE_INTTYPES_H
| # include <inttypes.h>
| #endif
| #ifdef HAVE_STDINT_H
| # include <stdint.h>
| #endif
| #ifdef HAVE_UNISTD_H
| # include <unistd.h>
| #endif
| #include <frame.h>
configure:10980: result: no
configure:10984: checking frame.h presence
configure:10999: gcc -E  conftest.c
conftest.c:45:19: error: frame.h: No such file or directory
configure:11006: $? = 1
configure: failed program was:
| /* confdefs.h.  */
| #define PACKAGE_NAME ""
| #define PACKAGE_TARNAME ""
| #define PACKAGE_VERSION ""
| #define PACKAGE_STRING ""
| #define PACKAGE_BUGREPORT ""
| #define UNIX 1
| #define STDC_HEADERS 1
| #define HAVE_SYS_WAIT_H 1
| #define FEAT_NORMAL 1
| #define USE_XSMP_INTERACT 1
| #define FEAT_CSCOPE 1
| #define FEAT_NETBEANS_INTG 1
| #define FEAT_MBYTE 1
| #define HAVE_X11_SM_SMLIB_H 1
| #define HAVE_DATE_TIME 1
| #define HAVE_DIRENT_H 1
| #define HAVE_STDARG_H 1
| #define HAVE_STDLIB_H 1
| #define HAVE_STRING_H 1
| #define HAVE_SYS_SELECT_H 1
| #define HAVE_SYS_UTSNAME_H 1
| #define HAVE_TERMCAP_H 1
| #define HAVE_FCNTL_H 1
| #define HAVE_SGTTY_H 1
| #define HAVE_SYS_IOCTL_H 1
| #define HAVE_SYS_TIME_H 1
| #define HAVE_SYS_TYPES_H 1
| #define HAVE_ICONV_H 1
| #define HAVE_LANGINFO_H 1
| #define HAVE_MATH_H 1
| #define HAVE_UNISTD_H 1
| #define HAVE_ERRNO_H 1
| #define HAVE_SYS_RESOURCE_H 1
| #define HAVE_LOCALE_H 1
| #define HAVE_TERMIOS_H 1
| #define HAVE_LIBC_H 1
| #define HAVE_POLL_H 1
| #define HAVE_SYS_POLL_H 1
| #define HAVE_PWD_H 1
| #define HAVE_UTIME_H 1
| #define HAVE_SYS_PARAM_H 1
| #define HAVE_LIBGEN_H 1
| /* end confdefs.h.  */
| #include <frame.h>
configure:11020: result: no
configure:11048: checking for frame.h
configure:11057: result: no
configure:10942: checking copyfile.h usability
configure:10959: gcc -c -arch i386 -arch x86_64 -g -Os -pipe -mdynamic-no-pic  conftest.c >&5
configure:10966: $? = 0
configure:10980: result: yes
configure:10984: checking copyfile.h presence
configure:10999: gcc -E  conftest.c
configure:11006: $? = 0
configure:11020: result: yes
configure:11048: checking for copyfile.h
configure:11057: result: yes
configure:10942: checking sys/acl.h usability
configure:10959: gcc -c -arch i386 -arch x86_64 -g -Os -pipe -mdynamic-no-pic  conftest.c >&5
configure:10966: $? = 0
configure:10980: result: yes
configure:10984: checking sys/acl.h presence
configure:10999: gcc -E  conftest.c
configure:11006: $? = 0
configure:11020: result: yes
configure:11048: checking for sys/acl.h
configure:11057: result: yes
configure:10942: checking sys/access.h usability
configure:10959: gcc -c -arch i386 -arch x86_64 -g -Os -pipe -mdynamic-no-pic  conftest.c >&5
conftest.c:80:24: error: sys/access.h: No such file or directory
conftest.c:80:24: error: sys/access.h: No such file or directory
lipo: can't open input file: /var/folders/IQ/IQuL0Q24Fna8hK1dP+jLgU+++TM/-Tmp-//ccNu7w9m.out (No such file or directory)
configure:10966: $? = 1
configure: failed program was:
| /* confdefs.h.  */
| #define PACKAGE_NAME ""
| #define PACKAGE_TARNAME ""
| #define PACKAGE_VERSION ""
| #define PACKAGE_STRING ""
| #define PACKAGE_BUGREPORT ""
| #define UNIX 1
| #define STDC_HEADERS 1
| #define HAVE_SYS_WAIT_H 1
| #define FEAT_NORMAL 1
| #define USE_XSMP_INTERACT 1
| #define FEAT_CSCOPE 1
| #define FEAT_NETBEANS_INTG 1
| #define FEAT_MBYTE 1
| #define HAVE_X11_SM_SMLIB_H 1
| #define HAVE_DATE_TIME 1
| #define HAVE_DIRENT_H 1
| #define HAVE_STDARG_H 1
| #define HAVE_STDLIB_H 1
| #define HAVE_STRING_H 1
| #define HAVE_SYS_SELECT_H 1
| #define HAVE_SYS_UTSNAME_H 1
| #define HAVE_TERMCAP_H 1
| #define HAVE_FCNTL_H 1
| #define HAVE_SGTTY_H 1
| #define HAVE_SYS_IOCTL_H 1
| #define HAVE_SYS_TIME_H 1
| #define HAVE_SYS_TYPES_H 1
| #define HAVE_ICONV_H 1
| #define HAVE_LANGINFO_H 1
| #define HAVE_MATH_H 1
| #define HAVE_UNISTD_H 1
| #define HAVE_ERRNO_H 1
| #define HAVE_SYS_RESOURCE_H 1
| #define HAVE_LOCALE_H 1
| #define HAVE_TERMIOS_H 1
| #define HAVE_LIBC_H 1
| #define HAVE_POLL_H 1
| #define HAVE_SYS_POLL_H 1
| #define HAVE_PWD_H 1
| #define HAVE_UTIME_H 1
| #define HAVE_SYS_PARAM_H 1
| #define HAVE_LIBGEN_H 1
| #define HAVE_COPYFILE_H 1
| #define HAVE_SYS_ACL_H 1
| /* end confdefs.h.  */
| #include <stdio.h>
| #ifdef HAVE_SYS_TYPES_H
| # include <sys/types.h>
| #endif
| #ifdef HAVE_SYS_STAT_H
| # include <sys/stat.h>
| #endif
| #ifdef STDC_HEADERS
| # include <stdlib.h>
| # include <stddef.h>
| #else
| # ifdef HAVE_STDLIB_H
| #  include <stdlib.h>
| # endif
| #endif
| #ifdef HAVE_STRING_H
| # if !defined STDC_HEADERS && defined HAVE_MEMORY_H
| #  include <memory.h>
| # endif
| # include <string.h>
| #endif
| #ifdef HAVE_STRINGS_H
| # include <strings.h>
| #endif
| #ifdef HAVE_INTTYPES_H
| # include <inttypes.h>
| #endif
| #ifdef HAVE_STDINT_H
| # include <stdint.h>
| #endif
| #ifdef HAVE_UNISTD_H
| # include <unistd.h>
| #endif
| #include <sys/access.h>
configure:10980: result: no
configure:10984: checking sys/access.h presence
configure:10999: gcc -E  conftest.c
conftest.c:47:24: error: sys/access.h: No such file or directory
configure:11006: $? = 1
configure: failed program was:
| /* confdefs.h.  */
| #define PACKAGE_NAME ""
| #define PACKAGE_TARNAME ""
| #define PACKAGE_VERSION ""
| #define PACKAGE_STRING ""
| #define PACKAGE_BUGREPORT ""
| #define UNIX 1
| #define STDC_HEADERS 1
| #define HAVE_SYS_WAIT_H 1
| #define FEAT_NORMAL 1
| #define USE_XSMP_INTERACT 1
| #define FEAT_CSCOPE 1
| #define FEAT_NETBEANS_INTG 1
| #define FEAT_MBYTE 1
| #define HAVE_X11_SM_SMLIB_H 1
| #define HAVE_DATE_TIME 1
| #define HAVE_DIRENT_H 1
| #define HAVE_STDARG_H 1
| #define HAVE_STDLIB_H 1
| #define HAVE_STRING_H 1
| #define HAVE_SYS_SELECT_H 1
| #define HAVE_SYS_UTSNAME_H 1
| #define HAVE_TERMCAP_H 1
| #define HAVE_FCNTL_H 1
| #define HAVE_SGTTY_H 1
| #define HAVE_SYS_IOCTL_H 1
| #define HAVE_SYS_TIME_H 1
| #define HAVE_SYS_TYPES_H 1
| #define HAVE_ICONV_H 1
| #define HAVE_LANGINFO_H 1
| #define HAVE_MATH_H 1
| #define HAVE_UNISTD_H 1
| #define HAVE_ERRNO_H 1
| #define HAVE_SYS_RESOURCE_H 1
| #define HAVE_LOCALE_H 1
| #define HAVE_TERMIOS_H 1
| #define HAVE_LIBC_H 1
| #define HAVE_POLL_H 1
| #define HAVE_SYS_POLL_H 1
| #define HAVE_PWD_H 1
| #define HAVE_UTIME_H 1
| #define HAVE_SYS_PARAM_H 1
| #define HAVE_LIBGEN_H 1
| #define HAVE_COPYFILE_H 1
| #define HAVE_SYS_ACL_H 1
| /* end confdefs.h.  */
| #include <sys/access.h>
configure:11020: result: no
configure:11048: checking for sys/access.h
configure:11057: result: no
configure:10942: checking sys/sysctl.h usability
configure:10959: gcc -c -arch i386 -arch x86_64 -g -Os -pipe -mdynamic-no-pic  conftest.c >&5
configure:10966: $? = 0
configure:10980: result: yes
configure:10984: checking sys/sysctl.h presence
configure:10999: gcc -E  conftest.c
configure:11006: $? = 0
configure:11020: result: yes
configure:11048: checking for sys/sysctl.h
configure:11057: result: yes
configure:10942: checking sys/sysinfo.h usability
configure:10959: gcc -c -arch i386 -arch x86_64 -g -Os -pipe -mdynamic-no-pic  conftest.c >&5
conftest.c:81:25: error: sys/sysinfo.h: No such file or directory
conftest.c:81:25: error: sys/sysinfo.h: No such file or directory
lipo: can't open input file: /var/folders/IQ/IQuL0Q24Fna8hK1dP+jLgU+++TM/-Tmp-//ccAY58ng.out (No such file or directory)
configure:10966: $? = 1
configure: failed program was:
| /* confdefs.h.  */
| #define PACKAGE_NAME ""
| #define PACKAGE_TARNAME ""
| #define PACKAGE_VERSION ""
| #define PACKAGE_STRING ""
| #define PACKAGE_BUGREPORT ""
| #define UNIX 1
| #define STDC_HEADERS 1
| #define HAVE_SYS_WAIT_H 1
| #define FEAT_NORMAL 1
| #define USE_XSMP_INTERACT 1
| #define FEAT_CSCOPE 1
| #define FEAT_NETBEANS_INTG 1
| #define FEAT_MBYTE 1
| #define HAVE_X11_SM_SMLIB_H 1
| #define HAVE_DATE_TIME 1
| #define HAVE_DIRENT_H 1
| #define HAVE_STDARG_H 1
| #define HAVE_STDLIB_H 1
| #define HAVE_STRING_H 1
| #define HAVE_SYS_SELECT_H 1
| #define HAVE_SYS_UTSNAME_H 1
| #define HAVE_TERMCAP_H 1
| #define HAVE_FCNTL_H 1
| #define HAVE_SGTTY_H 1
| #define HAVE_SYS_IOCTL_H 1
| #define HAVE_SYS_TIME_H 1
| #define HAVE_SYS_TYPES_H 1
| #define HAVE_ICONV_H 1
| #define HAVE_LANGINFO_H 1
| #define HAVE_MATH_H 1
| #define HAVE_UNISTD_H 1
| #define HAVE_ERRNO_H 1
| #define HAVE_SYS_RESOURCE_H 1
| #define HAVE_LOCALE_H 1
| #define HAVE_TERMIOS_H 1
| #define HAVE_LIBC_H 1
| #define HAVE_POLL_H 1
| #define HAVE_SYS_POLL_H 1
| #define HAVE_PWD_H 1
| #define HAVE_UTIME_H 1
| #define HAVE_SYS_PARAM_H 1
| #define HAVE_LIBGEN_H 1
| #define HAVE_COPYFILE_H 1
| #define HAVE_SYS_ACL_H 1
| #define HAVE_SYS_SYSCTL_H 1
| /* end confdefs.h.  */
| #include <stdio.h>
| #ifdef HAVE_SYS_TYPES_H
| # include <sys/types.h>
| #endif
| #ifdef HAVE_SYS_STAT_H
| # include <sys/stat.h>
| #endif
| #ifdef STDC_HEADERS
| # include <stdlib.h>
| # include <stddef.h>
| #else
| # ifdef HAVE_STDLIB_H
| #  include <stdlib.h>
| # endif
| #endif
| #ifdef HAVE_STRING_H
| # if !defined STDC_HEADERS && defined HAVE_MEMORY_H
| #  include <memory.h>
| # endif
| # include <string.h>
| #endif
| #ifdef HAVE_STRINGS_H
| # include <strings.h>
| #endif
| #ifdef HAVE_INTTYPES_H
| # include <inttypes.h>
| #endif
| #ifdef HAVE_STDINT_H
| # include <stdint.h>
| #endif
| #ifdef HAVE_UNISTD_H
| # include <unistd.h>
| #endif
| #include <sys/sysinfo.h>
configure:10980: result: no
configure:10984: checking sys/sysinfo.h presence
configure:10999: gcc -E  conftest.c
conftest.c:48:25: error: sys/sysinfo.h: No such file or directory
configure:11006: $? = 1
configure: failed program was:
| /* confdefs.h.  */
| #define PACKAGE_NAME ""
| #define PACKAGE_TARNAME ""
| #define PACKAGE_VERSION ""
| #define PACKAGE_STRING ""
| #define PACKAGE_BUGREPORT ""
| #define UNIX 1
| #define STDC_HEADERS 1
| #define HAVE_SYS_WAIT_H 1
| #define FEAT_NORMAL 1
| #define USE_XSMP_INTERACT 1
| #define FEAT_CSCOPE 1
| #define FEAT_NETBEANS_INTG 1
| #define FEAT_MBYTE 1
| #define HAVE_X11_SM_SMLIB_H 1
| #define HAVE_DATE_TIME 1
| #define HAVE_DIRENT_H 1
| #define HAVE_STDARG_H 1
| #define HAVE_STDLIB_H 1
| #define HAVE_STRING_H 1
| #define HAVE_SYS_SELECT_H 1
| #define HAVE_SYS_UTSNAME_H 1
| #define HAVE_TERMCAP_H 1
| #define HAVE_FCNTL_H 1
| #define HAVE_SGTTY_H 1
| #define HAVE_SYS_IOCTL_H 1
| #define HAVE_SYS_TIME_H 1
| #define HAVE_SYS_TYPES_H 1
| #define HAVE_ICONV_H 1
| #define HAVE_LANGINFO_H 1
| #define HAVE_MATH_H 1
| #define HAVE_UNISTD_H 1
| #define HAVE_ERRNO_H 1
| #define HAVE_SYS_RESOURCE_H 1
| #define HAVE_LOCALE_H 1
| #define HAVE_TERMIOS_H 1
| #define HAVE_LIBC_H 1
| #define HAVE_POLL_H 1
| #define HAVE_SYS_POLL_H 1
| #define HAVE_PWD_H 1
| #define HAVE_UTIME_H 1
| #define HAVE_SYS_PARAM_H 1
| #define HAVE_LIBGEN_H 1
| #define HAVE_COPYFILE_H 1
| #define HAVE_SYS_ACL_H 1
| #define HAVE_SYS_SYSCTL_H 1
| /* end confdefs.h.  */
| #include <sys/sysinfo.h>
configure:11020: result: no
configure:11048: checking for sys/sysinfo.h
configure:11057: result: no
configure:10942: checking wchar.h usability
configure:10959: gcc -c -arch i386 -arch x86_64 -g -Os -pipe -mdynamic-no-pic  conftest.c >&5
configure:10966: $? = 0
configure:10980: result: yes
configure:10984: checking wchar.h presence
configure:10999: gcc -E  conftest.c
configure:11006: $? = 0
configure:11020: result: yes
configure:11048: checking for wchar.h
configure:11057: result: yes
configure:10942: checking wctype.h usability
configure:10959: gcc -c -arch i386 -arch x86_64 -g -Os -pipe -mdynamic-no-pic  conftest.c >&5
configure:10966: $? = 0
configure:10980: result: yes
configure:10984: checking wctype.h presence
configure:10999: gcc -E  conftest.c
configure:11006: $? = 0
configure:11020: result: yes
configure:11048: checking for wctype.h
configure:11057: result: yes
configure:11076: checking for sys/ptem.h
configure:11099: gcc -c -arch i386 -arch x86_64 -g -Os -pipe -mdynamic-no-pic  conftest.c >&5
conftest.c:54:22: error: sys/ptem.h: No such file or directory
conftest.c:54:22: error: sys/ptem.h: No such file or directory
lipo: can't open input file: /var/folders/IQ/IQuL0Q24Fna8hK1dP+jLgU+++TM/-Tmp-//cc68uhkC.out (No such file or directory)
configure:11106: $? = 1
configure: failed program was:
| /* confdefs.h.  */
| #define PACKAGE_NAME ""
| #define PACKAGE_TARNAME ""
| #define PACKAGE_VERSION ""
| #define PACKAGE_STRING ""
| #define PACKAGE_BUGREPORT ""
| #define UNIX 1
| #define STDC_HEADERS 1
| #define HAVE_SYS_WAIT_H 1
| #define FEAT_NORMAL 1
| #define USE_XSMP_INTERACT 1
| #define FEAT_CSCOPE 1
| #define FEAT_NETBEANS_INTG 1
| #define FEAT_MBYTE 1
| #define HAVE_X11_SM_SMLIB_H 1
| #define HAVE_DATE_TIME 1
| #define HAVE_DIRENT_H 1
| #define HAVE_STDARG_H 1
| #define HAVE_STDLIB_H 1
| #define HAVE_STRING_H 1
| #define HAVE_SYS_SELECT_H 1
| #define HAVE_SYS_UTSNAME_H 1
| #define HAVE_TERMCAP_H 1
| #define HAVE_FCNTL_H 1
| #define HAVE_SGTTY_H 1
| #define HAVE_SYS_IOCTL_H 1
| #define HAVE_SYS_TIME_H 1
| #define HAVE_SYS_TYPES_H 1
| #define HAVE_ICONV_H 1
| #define HAVE_LANGINFO_H 1
| #define HAVE_MATH_H 1
| #define HAVE_UNISTD_H 1
| #define HAVE_ERRNO_H 1
| #define HAVE_SYS_RESOURCE_H 1
| #define HAVE_LOCALE_H 1
| #define HAVE_TERMIOS_H 1
| #define HAVE_LIBC_H 1
| #define HAVE_POLL_H 1
| #define HAVE_SYS_POLL_H 1
| #define HAVE_PWD_H 1
| #define HAVE_UTIME_H 1
| #define HAVE_SYS_PARAM_H 1
| #define HAVE_LIBGEN_H 1
| #define HAVE_COPYFILE_H 1
| #define HAVE_SYS_ACL_H 1
| #define HAVE_SYS_SYSCTL_H 1
| #define HAVE_WCHAR_H 1
| #define HAVE_WCTYPE_H 1
| /* end confdefs.h.  */
| #if defined HAVE_SYS_STREAM_H
| #  include <sys/stream.h>
| #endif
| 
| #include <sys/ptem.h>
configure:11123: result: no
configure:11137: checking for pthread_np.h
configure:11162: gcc -c -arch i386 -arch x86_64 -g -Os -pipe -mdynamic-no-pic  conftest.c >&5
conftest.c:52:24: error: pthread_np.h: No such file or directory
conftest.c:52:24: error: pthread_np.h: No such file or directory
lipo: can't open input file: /var/folders/IQ/IQuL0Q24Fna8hK1dP+jLgU+++TM/-Tmp-//ccf76BMn.out (No such file or directory)
configure:11169: $? = 1
configure: failed program was:
| /* confdefs.h.  */
| #define PACKAGE_NAME ""
| #define PACKAGE_TARNAME ""
| #define PACKAGE_VERSION ""
| #define PACKAGE_STRING ""
| #define PACKAGE_BUGREPORT ""
| #define UNIX 1
| #define STDC_HEADERS 1
| #define HAVE_SYS_WAIT_H 1
| #define FEAT_NORMAL 1
| #define USE_XSMP_INTERACT 1
| #define FEAT_CSCOPE 1
| #define FEAT_NETBEANS_INTG 1
| #define FEAT_MBYTE 1
| #define HAVE_X11_SM_SMLIB_H 1
| #define HAVE_DATE_TIME 1
| #define HAVE_DIRENT_H 1
| #define HAVE_STDARG_H 1
| #define HAVE_STDLIB_H 1
| #define HAVE_STRING_H 1
| #define HAVE_SYS_SELECT_H 1
| #define HAVE_SYS_UTSNAME_H 1
| #define HAVE_TERMCAP_H 1
| #define HAVE_FCNTL_H 1
| #define HAVE_SGTTY_H 1
| #define HAVE_SYS_IOCTL_H 1
| #define HAVE_SYS_TIME_H 1
| #define HAVE_SYS_TYPES_H 1
| #define HAVE_ICONV_H 1
| #define HAVE_LANGINFO_H 1
| #define HAVE_MATH_H 1
| #define HAVE_UNISTD_H 1
| #define HAVE_ERRNO_H 1
| #define HAVE_SYS_RESOURCE_H 1
| #define HAVE_LOCALE_H 1
| #define HAVE_TERMIOS_H 1
| #define HAVE_LIBC_H 1
| #define HAVE_POLL_H 1
| #define HAVE_SYS_POLL_H 1
| #define HAVE_PWD_H 1
| #define HAVE_UTIME_H 1
| #define HAVE_SYS_PARAM_H 1
| #define HAVE_LIBGEN_H 1
| #define HAVE_COPYFILE_H 1
| #define HAVE_SYS_ACL_H 1
| #define HAVE_SYS_SYSCTL_H 1
| #define HAVE_WCHAR_H 1
| #define HAVE_WCTYPE_H 1
| /* end confdefs.h.  */
| 
| #include <pthread.h>
| #include <pthread_np.h>
| int
| main ()
| {
| int i; i = 0;
|   ;
|   return 0;
| }
configure:11184: result: no
configure:11206: checking strings.h usability
configure:11223: gcc -c -arch i386 -arch x86_64 -g -Os -pipe -mdynamic-no-pic  conftest.c >&5
configure:11230: $? = 0
configure:11244: result: yes
configure:11248: checking strings.h presence
configure:11263: gcc -E  conftest.c
configure:11270: $? = 0
configure:11284: result: yes
configure:11312: checking for strings.h
configure:11321: result: yes
configure:11342: checking if strings.h can be included after string.h
configure:11381: gcc -c -arch i386 -arch x86_64 -g -Os -pipe -mdynamic-no-pic   conftest.c >&5
configure:11388: $? = 0
configure:11393: result: yes
configure:11412: checking whether gcc needs -traditional
conftest.c:51:20: error: termio.h: No such file or directory
configure:11454: result: no
configure:11461: checking for an ANSI C-conforming const
configure:11536: gcc -c -arch i386 -arch x86_64 -g -Os -pipe -mdynamic-no-pic  conftest.c >&5
configure:11543: $? = 0
configure:11558: result: yes
configure:11568: checking for mode_t
configure:11596: gcc -c -arch i386 -arch x86_64 -g -Os -pipe -mdynamic-no-pic  conftest.c >&5
configure:11603: $? = 0
configure:11630: gcc -c -arch i386 -arch x86_64 -g -Os -pipe -mdynamic-no-pic  conftest.c >&5
conftest.c: In function 'main':
conftest.c:87: error: expected expression before ')' token
conftest.c: In function 'main':
conftest.c:87: error: expected expression before ')' token
lipo: can't open input file: /var/folders/IQ/IQuL0Q24Fna8hK1dP+jLgU+++TM/-Tmp-//ccnR4Twv.out (No such file or directory)
configure:11637: $? = 1
configure: failed program was:
| /* confdefs.h.  */
| #define PACKAGE_NAME ""
| #define PACKAGE_TARNAME ""
| #define PACKAGE_VERSION ""
| #define PACKAGE_STRING ""
| #define PACKAGE_BUGREPORT ""
| #define UNIX 1
| #define STDC_HEADERS 1
| #define HAVE_SYS_WAIT_H 1
| #define FEAT_NORMAL 1
| #define USE_XSMP_INTERACT 1
| #define FEAT_CSCOPE 1
| #define FEAT_NETBEANS_INTG 1
| #define FEAT_MBYTE 1
| #define HAVE_X11_SM_SMLIB_H 1
| #define HAVE_DATE_TIME 1
| #define HAVE_DIRENT_H 1
| #define HAVE_STDARG_H 1
| #define HAVE_STDLIB_H 1
| #define HAVE_STRING_H 1
| #define HAVE_SYS_SELECT_H 1
| #define HAVE_SYS_UTSNAME_H 1
| #define HAVE_TERMCAP_H 1
| #define HAVE_FCNTL_H 1
| #define HAVE_SGTTY_H 1
| #define HAVE_SYS_IOCTL_H 1
| #define HAVE_SYS_TIME_H 1
| #define HAVE_SYS_TYPES_H 1
| #define HAVE_ICONV_H 1
| #define HAVE_LANGINFO_H 1
| #define HAVE_MATH_H 1
| #define HAVE_UNISTD_H 1
| #define HAVE_ERRNO_H 1
| #define HAVE_SYS_RESOURCE_H 1
| #define HAVE_LOCALE_H 1
| #define HAVE_TERMIOS_H 1
| #define HAVE_LIBC_H 1
| #define HAVE_POLL_H 1
| #define HAVE_SYS_POLL_H 1
| #define HAVE_PWD_H 1
| #define HAVE_UTIME_H 1
| #define HAVE_SYS_PARAM_H 1
| #define HAVE_LIBGEN_H 1
| #define HAVE_COPYFILE_H 1
| #define HAVE_SYS_ACL_H 1
| #define HAVE_SYS_SYSCTL_H 1
| #define HAVE_WCHAR_H 1
| #define HAVE_WCTYPE_H 1
| #define HAVE_STRINGS_H 1
| /* end confdefs.h.  */
| #include <stdio.h>
| #ifdef HAVE_SYS_TYPES_H
| # include <sys/types.h>
| #endif
| #ifdef HAVE_SYS_STAT_H
| # include <sys/stat.h>
| #endif
| #ifdef STDC_HEADERS
| # include <stdlib.h>
| # include <stddef.h>
| #else
| # ifdef HAVE_STDLIB_H
| #  include <stdlib.h>
| # endif
| #endif
| #ifdef HAVE_STRING_H
| # if !defined STDC_HEADERS && defined HAVE_MEMORY_H
| #  include <memory.h>
| # endif
| # include <string.h>
| #endif
| #ifdef HAVE_STRINGS_H
| # include <strings.h>
| #endif
| #ifdef HAVE_INTTYPES_H
| # include <inttypes.h>
| #endif
| #ifdef HAVE_STDINT_H
| # include <stdint.h>
| #endif
| #ifdef HAVE_UNISTD_H
| # include <unistd.h>
| #endif
| int
| main ()
| {
| if (sizeof ((mode_t)))
| 	  return 0;
|   ;
|   return 0;
| }
configure:11660: result: yes
configure:11672: checking for off_t
configure:11700: gcc -c -arch i386 -arch x86_64 -g -Os -pipe -mdynamic-no-pic  conftest.c >&5
configure:11707: $? = 0
configure:11734: gcc -c -arch i386 -arch x86_64 -g -Os -pipe -mdynamic-no-pic  conftest.c >&5
conftest.c: In function 'main':
conftest.c:87: error: expected expression before ')' token
conftest.c: In function 'main':
conftest.c:87: error: expected expression before ')' token
lipo: can't open input file: /var/folders/IQ/IQuL0Q24Fna8hK1dP+jLgU+++TM/-Tmp-//ccK4hCDv.out (No such file or directory)
configure:11741: $? = 1
configure: failed program was:
| /* confdefs.h.  */
| #define PACKAGE_NAME ""
| #define PACKAGE_TARNAME ""
| #define PACKAGE_VERSION ""
| #define PACKAGE_STRING ""
| #define PACKAGE_BUGREPORT ""
| #define UNIX 1
| #define STDC_HEADERS 1
| #define HAVE_SYS_WAIT_H 1
| #define FEAT_NORMAL 1
| #define USE_XSMP_INTERACT 1
| #define FEAT_CSCOPE 1
| #define FEAT_NETBEANS_INTG 1
| #define FEAT_MBYTE 1
| #define HAVE_X11_SM_SMLIB_H 1
| #define HAVE_DATE_TIME 1
| #define HAVE_DIRENT_H 1
| #define HAVE_STDARG_H 1
| #define HAVE_STDLIB_H 1
| #define HAVE_STRING_H 1
| #define HAVE_SYS_SELECT_H 1
| #define HAVE_SYS_UTSNAME_H 1
| #define HAVE_TERMCAP_H 1
| #define HAVE_FCNTL_H 1
| #define HAVE_SGTTY_H 1
| #define HAVE_SYS_IOCTL_H 1
| #define HAVE_SYS_TIME_H 1
| #define HAVE_SYS_TYPES_H 1
| #define HAVE_ICONV_H 1
| #define HAVE_LANGINFO_H 1
| #define HAVE_MATH_H 1
| #define HAVE_UNISTD_H 1
| #define HAVE_ERRNO_H 1
| #define HAVE_SYS_RESOURCE_H 1
| #define HAVE_LOCALE_H 1
| #define HAVE_TERMIOS_H 1
| #define HAVE_LIBC_H 1
| #define HAVE_POLL_H 1
| #define HAVE_SYS_POLL_H 1
| #define HAVE_PWD_H 1
| #define HAVE_UTIME_H 1
| #define HAVE_SYS_PARAM_H 1
| #define HAVE_LIBGEN_H 1
| #define HAVE_COPYFILE_H 1
| #define HAVE_SYS_ACL_H 1
| #define HAVE_SYS_SYSCTL_H 1
| #define HAVE_WCHAR_H 1
| #define HAVE_WCTYPE_H 1
| #define HAVE_STRINGS_H 1
| /* end confdefs.h.  */
| #include <stdio.h>
| #ifdef HAVE_SYS_TYPES_H
| # include <sys/types.h>
| #endif
| #ifdef HAVE_SYS_STAT_H
| # include <sys/stat.h>
| #endif
| #ifdef STDC_HEADERS
| # include <stdlib.h>
| # include <stddef.h>
| #else
| # ifdef HAVE_STDLIB_H
| #  include <stdlib.h>
| # endif
| #endif
| #ifdef HAVE_STRING_H
| # if !defined STDC_HEADERS && defined HAVE_MEMORY_H
| #  include <memory.h>
| # endif
| # include <string.h>
| #endif
| #ifdef HAVE_STRINGS_H
| # include <strings.h>
| #endif
| #ifdef HAVE_INTTYPES_H
| # include <inttypes.h>
| #endif
| #ifdef HAVE_STDINT_H
| # include <stdint.h>
| #endif
| #ifdef HAVE_UNISTD_H
| # include <unistd.h>
| #endif
| int
| main ()
| {
| if (sizeof ((off_t)))
| 	  return 0;
|   ;
|   return 0;
| }
configure:11764: result: yes
configure:11776: checking for pid_t
configure:11804: gcc -c -arch i386 -arch x86_64 -g -Os -pipe -mdynamic-no-pic  conftest.c >&5
configure:11811: $? = 0
configure:11838: gcc -c -arch i386 -arch x86_64 -g -Os -pipe -mdynamic-no-pic  conftest.c >&5
conftest.c: In function 'main':
conftest.c:87: error: expected expression before ')' token
conftest.c: In function 'main':
conftest.c:87: error: expected expression before ')' token
lipo: can't open input file: /var/folders/IQ/IQuL0Q24Fna8hK1dP+jLgU+++TM/-Tmp-//cc60LGWj.out (No such file or directory)
configure:11845: $? = 1
configure: failed program was:
| /* confdefs.h.  */
| #define PACKAGE_NAME ""
| #define PACKAGE_TARNAME ""
| #define PACKAGE_VERSION ""
| #define PACKAGE_STRING ""
| #define PACKAGE_BUGREPORT ""
| #define UNIX 1
| #define STDC_HEADERS 1
| #define HAVE_SYS_WAIT_H 1
| #define FEAT_NORMAL 1
| #define USE_XSMP_INTERACT 1
| #define FEAT_CSCOPE 1
| #define FEAT_NETBEANS_INTG 1
| #define FEAT_MBYTE 1
| #define HAVE_X11_SM_SMLIB_H 1
| #define HAVE_DATE_TIME 1
| #define HAVE_DIRENT_H 1
| #define HAVE_STDARG_H 1
| #define HAVE_STDLIB_H 1
| #define HAVE_STRING_H 1
| #define HAVE_SYS_SELECT_H 1
| #define HAVE_SYS_UTSNAME_H 1
| #define HAVE_TERMCAP_H 1
| #define HAVE_FCNTL_H 1
| #define HAVE_SGTTY_H 1
| #define HAVE_SYS_IOCTL_H 1
| #define HAVE_SYS_TIME_H 1
| #define HAVE_SYS_TYPES_H 1
| #define HAVE_ICONV_H 1
| #define HAVE_LANGINFO_H 1
| #define HAVE_MATH_H 1
| #define HAVE_UNISTD_H 1
| #define HAVE_ERRNO_H 1
| #define HAVE_SYS_RESOURCE_H 1
| #define HAVE_LOCALE_H 1
| #define HAVE_TERMIOS_H 1
| #define HAVE_LIBC_H 1
| #define HAVE_POLL_H 1
| #define HAVE_SYS_POLL_H 1
| #define HAVE_PWD_H 1
| #define HAVE_UTIME_H 1
| #define HAVE_SYS_PARAM_H 1
| #define HAVE_LIBGEN_H 1
| #define HAVE_COPYFILE_H 1
| #define HAVE_SYS_ACL_H 1
| #define HAVE_SYS_SYSCTL_H 1
| #define HAVE_WCHAR_H 1
| #define HAVE_WCTYPE_H 1
| #define HAVE_STRINGS_H 1
| /* end confdefs.h.  */
| #include <stdio.h>
| #ifdef HAVE_SYS_TYPES_H
| # include <sys/types.h>
| #endif
| #ifdef HAVE_SYS_STAT_H
| # include <sys/stat.h>
| #endif
| #ifdef STDC_HEADERS
| # include <stdlib.h>
| # include <stddef.h>
| #else
| # ifdef HAVE_STDLIB_H
| #  include <stdlib.h>
| # endif
| #endif
| #ifdef HAVE_STRING_H
| # if !defined STDC_HEADERS && defined HAVE_MEMORY_H
| #  include <memory.h>
| # endif
| # include <string.h>
| #endif
| #ifdef HAVE_STRINGS_H
| # include <strings.h>
| #endif
| #ifdef HAVE_INTTYPES_H
| # include <inttypes.h>
| #endif
| #ifdef HAVE_STDINT_H
| # include <stdint.h>
| #endif
| #ifdef HAVE_UNISTD_H
| # include <unistd.h>
| #endif
| int
| main ()
| {
| if (sizeof ((pid_t)))
| 	  return 0;
|   ;
|   return 0;
| }
configure:11868: result: yes
configure:11880: checking for size_t
configure:11908: gcc -c -arch i386 -arch x86_64 -g -Os -pipe -mdynamic-no-pic  conftest.c >&5
configure:11915: $? = 0
configure:11942: gcc -c -arch i386 -arch x86_64 -g -Os -pipe -mdynamic-no-pic  conftest.c >&5
conftest.c: In function 'main':
conftest.c:87: error: expected expression before ')' token
conftest.c: In function 'main':
conftest.c:87: error: expected expression before ')' token
lipo: can't open input file: /var/folders/IQ/IQuL0Q24Fna8hK1dP+jLgU+++TM/-Tmp-//cco3HGR4.out (No such file or directory)
configure:11949: $? = 1
configure: failed program was:
| /* confdefs.h.  */
| #define PACKAGE_NAME ""
| #define PACKAGE_TARNAME ""
| #define PACKAGE_VERSION ""
| #define PACKAGE_STRING ""
| #define PACKAGE_BUGREPORT ""
| #define UNIX 1
| #define STDC_HEADERS 1
| #define HAVE_SYS_WAIT_H 1
| #define FEAT_NORMAL 1
| #define USE_XSMP_INTERACT 1
| #define FEAT_CSCOPE 1
| #define FEAT_NETBEANS_INTG 1
| #define FEAT_MBYTE 1
| #define HAVE_X11_SM_SMLIB_H 1
| #define HAVE_DATE_TIME 1
| #define HAVE_DIRENT_H 1
| #define HAVE_STDARG_H 1
| #define HAVE_STDLIB_H 1
| #define HAVE_STRING_H 1
| #define HAVE_SYS_SELECT_H 1
| #define HAVE_SYS_UTSNAME_H 1
| #define HAVE_TERMCAP_H 1
| #define HAVE_FCNTL_H 1
| #define HAVE_SGTTY_H 1
| #define HAVE_SYS_IOCTL_H 1
| #define HAVE_SYS_TIME_H 1
| #define HAVE_SYS_TYPES_H 1
| #define HAVE_ICONV_H 1
| #define HAVE_LANGINFO_H 1
| #define HAVE_MATH_H 1
| #define HAVE_UNISTD_H 1
| #define HAVE_ERRNO_H 1
| #define HAVE_SYS_RESOURCE_H 1
| #define HAVE_LOCALE_H 1
| #define HAVE_TERMIOS_H 1
| #define HAVE_LIBC_H 1
| #define HAVE_POLL_H 1
| #define HAVE_SYS_POLL_H 1
| #define HAVE_PWD_H 1
| #define HAVE_UTIME_H 1
| #define HAVE_SYS_PARAM_H 1
| #define HAVE_LIBGEN_H 1
| #define HAVE_COPYFILE_H 1
| #define HAVE_SYS_ACL_H 1
| #define HAVE_SYS_SYSCTL_H 1
| #define HAVE_WCHAR_H 1
| #define HAVE_WCTYPE_H 1
| #define HAVE_STRINGS_H 1
| /* end confdefs.h.  */
| #include <stdio.h>
| #ifdef HAVE_SYS_TYPES_H
| # include <sys/types.h>
| #endif
| #ifdef HAVE_SYS_STAT_H
| # include <sys/stat.h>
| #endif
| #ifdef STDC_HEADERS
| # include <stdlib.h>
| # include <stddef.h>
| #else
| # ifdef HAVE_STDLIB_H
| #  include <stdlib.h>
| # endif
| #endif
| #ifdef HAVE_STRING_H
| # if !defined STDC_HEADERS && defined HAVE_MEMORY_H
| #  include <memory.h>
| # endif
| # include <string.h>
| #endif
| #ifdef HAVE_STRINGS_H
| # include <strings.h>
| #endif
| #ifdef HAVE_INTTYPES_H
| # include <inttypes.h>
| #endif
| #ifdef HAVE_STDINT_H
| # include <stdint.h>
| #endif
| #ifdef HAVE_UNISTD_H
| # include <unistd.h>
| #endif
| int
| main ()
| {
| if (sizeof ((size_t)))
| 	  return 0;
|   ;
|   return 0;
| }
configure:11972: result: yes
configure:11984: checking for uid_t in sys/types.h
configure:12007: result: yes
configure:12022: checking whether time.h and sys/time.h may both be included
configure:12052: gcc -c -arch i386 -arch x86_64 -g -Os -pipe -mdynamic-no-pic  conftest.c >&5
configure:12059: $? = 0
configure:12074: result: yes
configure:12084: checking for ino_t
configure:12112: gcc -c -arch i386 -arch x86_64 -g -Os -pipe -mdynamic-no-pic  conftest.c >&5
configure:12119: $? = 0
configure:12146: gcc -c -arch i386 -arch x86_64 -g -Os -pipe -mdynamic-no-pic  conftest.c >&5
conftest.c: In function 'main':
conftest.c:88: error: expected expression before ')' token
conftest.c: In function 'main':
conftest.c:88: error: expected expression before ')' token
lipo: can't open input file: /var/folders/IQ/IQuL0Q24Fna8hK1dP+jLgU+++TM/-Tmp-//ccSCWH2q.out (No such file or directory)
configure:12153: $? = 1
configure: failed program was:
| /* confdefs.h.  */
| #define PACKAGE_NAME ""
| #define PACKAGE_TARNAME ""
| #define PACKAGE_VERSION ""
| #define PACKAGE_STRING ""
| #define PACKAGE_BUGREPORT ""
| #define UNIX 1
| #define STDC_HEADERS 1
| #define HAVE_SYS_WAIT_H 1
| #define FEAT_NORMAL 1
| #define USE_XSMP_INTERACT 1
| #define FEAT_CSCOPE 1
| #define FEAT_NETBEANS_INTG 1
| #define FEAT_MBYTE 1
| #define HAVE_X11_SM_SMLIB_H 1
| #define HAVE_DATE_TIME 1
| #define HAVE_DIRENT_H 1
| #define HAVE_STDARG_H 1
| #define HAVE_STDLIB_H 1
| #define HAVE_STRING_H 1
| #define HAVE_SYS_SELECT_H 1
| #define HAVE_SYS_UTSNAME_H 1
| #define HAVE_TERMCAP_H 1
| #define HAVE_FCNTL_H 1
| #define HAVE_SGTTY_H 1
| #define HAVE_SYS_IOCTL_H 1
| #define HAVE_SYS_TIME_H 1
| #define HAVE_SYS_TYPES_H 1
| #define HAVE_ICONV_H 1
| #define HAVE_LANGINFO_H 1
| #define HAVE_MATH_H 1
| #define HAVE_UNISTD_H 1
| #define HAVE_ERRNO_H 1
| #define HAVE_SYS_RESOURCE_H 1
| #define HAVE_LOCALE_H 1
| #define HAVE_TERMIOS_H 1
| #define HAVE_LIBC_H 1
| #define HAVE_POLL_H 1
| #define HAVE_SYS_POLL_H 1
| #define HAVE_PWD_H 1
| #define HAVE_UTIME_H 1
| #define HAVE_SYS_PARAM_H 1
| #define HAVE_LIBGEN_H 1
| #define HAVE_COPYFILE_H 1
| #define HAVE_SYS_ACL_H 1
| #define HAVE_SYS_SYSCTL_H 1
| #define HAVE_WCHAR_H 1
| #define HAVE_WCTYPE_H 1
| #define HAVE_STRINGS_H 1
| #define TIME_WITH_SYS_TIME 1
| /* end confdefs.h.  */
| #include <stdio.h>
| #ifdef HAVE_SYS_TYPES_H
| # include <sys/types.h>
| #endif
| #ifdef HAVE_SYS_STAT_H
| # include <sys/stat.h>
| #endif
| #ifdef STDC_HEADERS
| # include <stdlib.h>
| # include <stddef.h>
| #else
| # ifdef HAVE_STDLIB_H
| #  include <stdlib.h>
| # endif
| #endif
| #ifdef HAVE_STRING_H
| # if !defined STDC_HEADERS && defined HAVE_MEMORY_H
| #  include <memory.h>
| # endif
| # include <string.h>
| #endif
| #ifdef HAVE_STRINGS_H
| # include <strings.h>
| #endif
| #ifdef HAVE_INTTYPES_H
| # include <inttypes.h>
| #endif
| #ifdef HAVE_STDINT_H
| # include <stdint.h>
| #endif
| #ifdef HAVE_UNISTD_H
| # include <unistd.h>
| #endif
| int
| main ()
| {
| if (sizeof ((ino_t)))
| 	  return 0;
|   ;
|   return 0;
| }
configure:12176: result: yes
configure:12188: checking for dev_t
configure:12216: gcc -c -arch i386 -arch x86_64 -g -Os -pipe -mdynamic-no-pic  conftest.c >&5
configure:12223: $? = 0
configure:12250: gcc -c -arch i386 -arch x86_64 -g -Os -pipe -mdynamic-no-pic  conftest.c >&5
conftest.c: In function 'main':
conftest.c:88: error: expected expression before ')' token
conftest.c: In function 'main':
conftest.c:88: error: expected expression before ')' token
lipo: can't open input file: /var/folders/IQ/IQuL0Q24Fna8hK1dP+jLgU+++TM/-Tmp-//ccIFP21x.out (No such file or directory)
configure:12257: $? = 1
configure: failed program was:
| /* confdefs.h.  */
| #define PACKAGE_NAME ""
| #define PACKAGE_TARNAME ""
| #define PACKAGE_VERSION ""
| #define PACKAGE_STRING ""
| #define PACKAGE_BUGREPORT ""
| #define UNIX 1
| #define STDC_HEADERS 1
| #define HAVE_SYS_WAIT_H 1
| #define FEAT_NORMAL 1
| #define USE_XSMP_INTERACT 1
| #define FEAT_CSCOPE 1
| #define FEAT_NETBEANS_INTG 1
| #define FEAT_MBYTE 1
| #define HAVE_X11_SM_SMLIB_H 1
| #define HAVE_DATE_TIME 1
| #define HAVE_DIRENT_H 1
| #define HAVE_STDARG_H 1
| #define HAVE_STDLIB_H 1
| #define HAVE_STRING_H 1
| #define HAVE_SYS_SELECT_H 1
| #define HAVE_SYS_UTSNAME_H 1
| #define HAVE_TERMCAP_H 1
| #define HAVE_FCNTL_H 1
| #define HAVE_SGTTY_H 1
| #define HAVE_SYS_IOCTL_H 1
| #define HAVE_SYS_TIME_H 1
| #define HAVE_SYS_TYPES_H 1
| #define HAVE_ICONV_H 1
| #define HAVE_LANGINFO_H 1
| #define HAVE_MATH_H 1
| #define HAVE_UNISTD_H 1
| #define HAVE_ERRNO_H 1
| #define HAVE_SYS_RESOURCE_H 1
| #define HAVE_LOCALE_H 1
| #define HAVE_TERMIOS_H 1
| #define HAVE_LIBC_H 1
| #define HAVE_POLL_H 1
| #define HAVE_SYS_POLL_H 1
| #define HAVE_PWD_H 1
| #define HAVE_UTIME_H 1
| #define HAVE_SYS_PARAM_H 1
| #define HAVE_LIBGEN_H 1
| #define HAVE_COPYFILE_H 1
| #define HAVE_SYS_ACL_H 1
| #define HAVE_SYS_SYSCTL_H 1
| #define HAVE_WCHAR_H 1
| #define HAVE_WCTYPE_H 1
| #define HAVE_STRINGS_H 1
| #define TIME_WITH_SYS_TIME 1
| /* end confdefs.h.  */
| #include <stdio.h>
| #ifdef HAVE_SYS_TYPES_H
| # include <sys/types.h>
| #endif
| #ifdef HAVE_SYS_STAT_H
| # include <sys/stat.h>
| #endif
| #ifdef STDC_HEADERS
| # include <stdlib.h>
| # include <stddef.h>
| #else
| # ifdef HAVE_STDLIB_H
| #  include <stdlib.h>
| # endif
| #endif
| #ifdef HAVE_STRING_H
| # if !defined STDC_HEADERS && defined HAVE_MEMORY_H
| #  include <memory.h>
| # endif
| # include <string.h>
| #endif
| #ifdef HAVE_STRINGS_H
| # include <strings.h>
| #endif
| #ifdef HAVE_INTTYPES_H
| # include <inttypes.h>
| #endif
| #ifdef HAVE_STDINT_H
| # include <stdint.h>
| #endif
| #ifdef HAVE_UNISTD_H
| # include <unistd.h>
| #endif
| int
| main ()
| {
| if (sizeof ((dev_t)))
| 	  return 0;
|   ;
|   return 0;
| }
configure:12280: result: yes
configure:12293: checking for rlim_t
configure:12324: result: yes
configure:12333: checking for stack_t
configure:12362: result: yes
configure:12371: checking whether stack_t has an ss_base field
configure:12402: gcc -c -arch i386 -arch x86_64 -g -Os -pipe -mdynamic-no-pic  conftest.c >&5
conftest.c: In function 'main':
conftest.c:64: error: 'stack_t' has no member named 'ss_base'
conftest.c: In function 'main':
conftest.c:64: error: 'stack_t' has no member named 'ss_base'
lipo: can't open input file: /var/folders/IQ/IQuL0Q24Fna8hK1dP+jLgU+++TM/-Tmp-//cc7opQhg.out (No such file or directory)
configure:12409: $? = 1
configure: failed program was:
| /* confdefs.h.  */
| #define PACKAGE_NAME ""
| #define PACKAGE_TARNAME ""
| #define PACKAGE_VERSION ""
| #define PACKAGE_STRING ""
| #define PACKAGE_BUGREPORT ""
| #define UNIX 1
| #define STDC_HEADERS 1
| #define HAVE_SYS_WAIT_H 1
| #define FEAT_NORMAL 1
| #define USE_XSMP_INTERACT 1
| #define FEAT_CSCOPE 1
| #define FEAT_NETBEANS_INTG 1
| #define FEAT_MBYTE 1
| #define HAVE_X11_SM_SMLIB_H 1
| #define HAVE_DATE_TIME 1
| #define HAVE_DIRENT_H 1
| #define HAVE_STDARG_H 1
| #define HAVE_STDLIB_H 1
| #define HAVE_STRING_H 1
| #define HAVE_SYS_SELECT_H 1
| #define HAVE_SYS_UTSNAME_H 1
| #define HAVE_TERMCAP_H 1
| #define HAVE_FCNTL_H 1
| #define HAVE_SGTTY_H 1
| #define HAVE_SYS_IOCTL_H 1
| #define HAVE_SYS_TIME_H 1
| #define HAVE_SYS_TYPES_H 1
| #define HAVE_ICONV_H 1
| #define HAVE_LANGINFO_H 1
| #define HAVE_MATH_H 1
| #define HAVE_UNISTD_H 1
| #define HAVE_ERRNO_H 1
| #define HAVE_SYS_RESOURCE_H 1
| #define HAVE_LOCALE_H 1
| #define HAVE_TERMIOS_H 1
| #define HAVE_LIBC_H 1
| #define HAVE_POLL_H 1
| #define HAVE_SYS_POLL_H 1
| #define HAVE_PWD_H 1
| #define HAVE_UTIME_H 1
| #define HAVE_SYS_PARAM_H 1
| #define HAVE_LIBGEN_H 1
| #define HAVE_COPYFILE_H 1
| #define HAVE_SYS_ACL_H 1
| #define HAVE_SYS_SYSCTL_H 1
| #define HAVE_WCHAR_H 1
| #define HAVE_WCTYPE_H 1
| #define HAVE_STRINGS_H 1
| #define TIME_WITH_SYS_TIME 1
| /* end confdefs.h.  */
| 
| #include <sys/types.h>
| #if STDC_HEADERS
| # include <stdlib.h>
| # include <stddef.h>
| #endif
| #include <signal.h>
| #include "confdefs.h"
| 
| int
| main ()
| {
| stack_t sigstk; sigstk.ss_base = 0;
|   ;
|   return 0;
| }
configure:12423: result: no
configure:12430: checking --with-tlib argument
configure:12439: result: ncurses
configure:12442: checking for linking with ncurses library
configure:12465: gcc -o conftest -arch i386 -arch x86_64 -g -Os -pipe -mdynamic-no-pic  -arch i386 -arch x86_64 -L/usr/local/lib conftest.c  -lncurses >&5
configure:12472: $? = 0
configure:12480: result: OK
configure:12653: checking for tgetent()
configure:12676: gcc -o conftest -arch i386 -arch x86_64 -g -Os -pipe -mdynamic-no-pic  -arch i386 -arch x86_64 -L/usr/local/lib conftest.c  -lncurses >&5
configure:12683: $? = 0
configure:12691: result: yes
configure:12711: checking whether we talk terminfo
configure:12747: gcc -o conftest -arch i386 -arch x86_64 -g -Os -pipe -mdynamic-no-pic  -arch i386 -arch x86_64 -L/usr/local/lib conftest.c  -lncurses >&5
configure:12751: $? = 0
configure:12757: ./conftest
configure:12761: $? = 1
configure: program exited with status 1
configure: failed program was:
| 
| #include "confdefs.h"
| #ifdef HAVE_TERMCAP_H
| # include <termcap.h>
| #endif
| #ifdef HAVE_STRING_H
| # include <string.h>
| #endif
| #if STDC_HEADERS
| # include <stdlib.h>
| # include <stddef.h>
| #endif
| main()
| {char *s; s=(char *)tgoto("%p1%d", 0, 1); exit(!strcmp(s==0 ? "" : s, "1")); }
| 
configure:12783: result: yes
configure:12874: checking whether termcap.h contains ospeed
configure:12901: gcc -o conftest -arch i386 -arch x86_64 -g -Os -pipe -mdynamic-no-pic  -arch i386 -arch x86_64 -L/usr/local/lib conftest.c  -lncurses >&5
configure:12908: $? = 0
configure:12916: result: yes
configure:12993: checking whether termcap.h contains UP, BC and PC
configure:13020: gcc -o conftest -arch i386 -arch x86_64 -g -Os -pipe -mdynamic-no-pic  -arch i386 -arch x86_64 -L/usr/local/lib conftest.c  -lncurses >&5
configure:13027: $? = 0
configure:13035: result: yes
configure:13112: checking whether tputs() uses outfuntype
configure:13139: gcc -c -arch i386 -arch x86_64 -g -Os -pipe -mdynamic-no-pic  conftest.c >&5
conftest.c: In function 'main':
conftest.c:63: error: 'outfuntype' undeclared (first use in this function)
conftest.c:63: error: (Each undeclared identifier is reported only once
conftest.c:63: error: for each function it appears in.)
conftest.c:63: error: expected ')' before 'xx'
conftest.c: In function 'main':
conftest.c:63: error: 'outfuntype' undeclared (first use in this function)
conftest.c:63: error: (Each undeclared identifier is reported only once
conftest.c:63: error: for each function it appears in.)
conftest.c:63: error: expected ')' before 'xx'
lipo: can't open input file: /var/folders/IQ/IQuL0Q24Fna8hK1dP+jLgU+++TM/-Tmp-//ccXH1bpv.out (No such file or directory)
configure:13146: $? = 1
configure: failed program was:
| /* confdefs.h.  */
| #define PACKAGE_NAME ""
| #define PACKAGE_TARNAME ""
| #define PACKAGE_VERSION ""
| #define PACKAGE_STRING ""
| #define PACKAGE_BUGREPORT ""
| #define UNIX 1
| #define STDC_HEADERS 1
| #define HAVE_SYS_WAIT_H 1
| #define FEAT_NORMAL 1
| #define USE_XSMP_INTERACT 1
| #define FEAT_CSCOPE 1
| #define FEAT_NETBEANS_INTG 1
| #define FEAT_MBYTE 1
| #define HAVE_X11_SM_SMLIB_H 1
| #define HAVE_DATE_TIME 1
| #define HAVE_DIRENT_H 1
| #define HAVE_STDARG_H 1
| #define HAVE_STDLIB_H 1
| #define HAVE_STRING_H 1
| #define HAVE_SYS_SELECT_H 1
| #define HAVE_SYS_UTSNAME_H 1
| #define HAVE_TERMCAP_H 1
| #define HAVE_FCNTL_H 1
| #define HAVE_SGTTY_H 1
| #define HAVE_SYS_IOCTL_H 1
| #define HAVE_SYS_TIME_H 1
| #define HAVE_SYS_TYPES_H 1
| #define HAVE_ICONV_H 1
| #define HAVE_LANGINFO_H 1
| #define HAVE_MATH_H 1
| #define HAVE_UNISTD_H 1
| #define HAVE_ERRNO_H 1
| #define HAVE_SYS_RESOURCE_H 1
| #define HAVE_LOCALE_H 1
| #define HAVE_TERMIOS_H 1
| #define HAVE_LIBC_H 1
| #define HAVE_POLL_H 1
| #define HAVE_SYS_POLL_H 1
| #define HAVE_PWD_H 1
| #define HAVE_UTIME_H 1
| #define HAVE_SYS_PARAM_H 1
| #define HAVE_LIBGEN_H 1
| #define HAVE_COPYFILE_H 1
| #define HAVE_SYS_ACL_H 1
| #define HAVE_SYS_SYSCTL_H 1
| #define HAVE_WCHAR_H 1
| #define HAVE_WCTYPE_H 1
| #define HAVE_STRINGS_H 1
| #define TIME_WITH_SYS_TIME 1
| #define TERMINFO 1
| #define HAVE_OSPEED 1
| #define HAVE_UP_BC_PC 1
| /* end confdefs.h.  */
| 
| #ifdef HAVE_TERMCAP_H
| # include <termcap.h>
| #endif
| 
| int
| main ()
| {
| extern int xx(); tputs("test", 1, (outfuntype)xx)
|   ;
|   return 0;
| }
configure:13160: result: no
configure:13166: checking whether sys/select.h and sys/time.h may both be included
configure:13192: gcc -c -arch i386 -arch x86_64 -g -Os -pipe -mdynamic-no-pic  conftest.c >&5
configure:13199: $? = 0
configure:13204: result: yes
configure:13221: checking for /dev/ptc
configure:13231: result: no
configure:13235: checking for SVR4 ptys
configure:13259: gcc -o conftest -arch i386 -arch x86_64 -g -Os -pipe -mdynamic-no-pic  -arch i386 -arch x86_64 -L/usr/local/lib conftest.c  -lncurses >&5
configure:13266: $? = 0
configure:13274: result: yes
configure:13295: checking for ptyranges
configure:13332: result: pqrstuvw / 0123456789abcdef
configure:13340: checking default tty permissions/group
configure:13398: gcc -o conftest -arch i386 -arch x86_64 -g -Os -pipe -mdynamic-no-pic  -arch i386 -arch x86_64 -L/usr/local/lib conftest.c  -lncurses >&5
configure:13402: $? = 0
configure:13408: ./conftest
configure:13412: $? = 1
configure: program exited with status 1
configure: failed program was:
| 
| #include "confdefs.h"
| #include <sys/types.h>
| #if STDC_HEADERS
| # include <stdlib.h>
| # include <stddef.h>
| #endif
| #ifdef HAVE_UNISTD_H
| #include <unistd.h>
| #endif
| #include <sys/stat.h>
| #include <stdio.h>
| main()
| {
|   struct stat sb;
|   char *x,*ttyname();
|   int om, m;
|   FILE *fp;
| 
|   if (!(x = ttyname(0))) exit(1);
|   if (stat(x, &sb)) exit(1);
|   om = sb.st_mode;
|   if (om & 002) exit(0);
|   m = system("mesg y");
|   if (m == -1 || m == 127) exit(1);
|   if (stat(x, &sb)) exit(1);
|   m = sb.st_mode;
|   if (chmod(x, om)) exit(1);
|   if (m & 002) exit(0);
|   if (sb.st_gid == getgid()) exit(1);
|   if (!(fp=fopen("conftest_grp", "w")))
|     exit(1);
|   fprintf(fp, "%d\n", sb.st_gid);
|   fclose(fp);
|   exit(0);
| }
| 
configure:13436: result: can't determine - assume ptys are world accessable
configure:13447: result: world
configure:13469: checking return type of signal handlers
configure:13497: gcc -c -arch i386 -arch x86_64 -g -Os -pipe -mdynamic-no-pic  conftest.c >&5
conftest.c: In function 'main':
conftest.c:65: error: void value not ignored as it ought to be
conftest.c: In function 'main':
conftest.c:65: error: void value not ignored as it ought to be
lipo: can't open input file: /var/folders/IQ/IQuL0Q24Fna8hK1dP+jLgU+++TM/-Tmp-//ccGaF6zo.out (No such file or directory)
configure:13504: $? = 1
configure: failed program was:
| /* confdefs.h.  */
| #define PACKAGE_NAME ""
| #define PACKAGE_TARNAME ""
| #define PACKAGE_VERSION ""
| #define PACKAGE_STRING ""
| #define PACKAGE_BUGREPORT ""
| #define UNIX 1
| #define STDC_HEADERS 1
| #define HAVE_SYS_WAIT_H 1
| #define FEAT_NORMAL 1
| #define USE_XSMP_INTERACT 1
| #define FEAT_CSCOPE 1
| #define FEAT_NETBEANS_INTG 1
| #define FEAT_MBYTE 1
| #define HAVE_X11_SM_SMLIB_H 1
| #define HAVE_DATE_TIME 1
| #define HAVE_DIRENT_H 1
| #define HAVE_STDARG_H 1
| #define HAVE_STDLIB_H 1
| #define HAVE_STRING_H 1
| #define HAVE_SYS_SELECT_H 1
| #define HAVE_SYS_UTSNAME_H 1
| #define HAVE_TERMCAP_H 1
| #define HAVE_FCNTL_H 1
| #define HAVE_SGTTY_H 1
| #define HAVE_SYS_IOCTL_H 1
| #define HAVE_SYS_TIME_H 1
| #define HAVE_SYS_TYPES_H 1
| #define HAVE_ICONV_H 1
| #define HAVE_LANGINFO_H 1
| #define HAVE_MATH_H 1
| #define HAVE_UNISTD_H 1
| #define HAVE_ERRNO_H 1
| #define HAVE_SYS_RESOURCE_H 1
| #define HAVE_LOCALE_H 1
| #define HAVE_TERMIOS_H 1
| #define HAVE_LIBC_H 1
| #define HAVE_POLL_H 1
| #define HAVE_SYS_POLL_H 1
| #define HAVE_PWD_H 1
| #define HAVE_UTIME_H 1
| #define HAVE_SYS_PARAM_H 1
| #define HAVE_LIBGEN_H 1
| #define HAVE_COPYFILE_H 1
| #define HAVE_SYS_ACL_H 1
| #define HAVE_SYS_SYSCTL_H 1
| #define HAVE_WCHAR_H 1
| #define HAVE_WCTYPE_H 1
| #define HAVE_STRINGS_H 1
| #define TIME_WITH_SYS_TIME 1
| #define TERMINFO 1
| #define HAVE_OSPEED 1
| #define HAVE_UP_BC_PC 1
| #define SYS_SELECT_WITH_SYS_TIME 1
| #define HAVE_SVR4_PTYS 1
| #define PTYRANGE0 "pqrstuvw"
| #define PTYRANGE1 "0123456789abcdef"
| /* end confdefs.h.  */
| #include <sys/types.h>
| #include <signal.h>
| 
| int
| main ()
| {
| return *(signal (0, 0)) (0) == 1;
|   ;
|   return 0;
| }
configure:13519: result: void
configure:13540: checking for struct sigcontext
configure:13570: gcc -c -arch i386 -arch x86_64 -g -Os -pipe -mdynamic-no-pic  conftest.c >&5
configure:13577: $? = 0
configure:13582: result: yes
configure:13598: checking getcwd implementation is broken
configure:13633: gcc -o conftest -arch i386 -arch x86_64 -g -Os -pipe -mdynamic-no-pic  -arch i386 -arch x86_64 -L/usr/local/lib conftest.c  -lncurses >&5
configure:13637: $? = 0
configure:13643: ./conftest
configure:13647: $? = 0
configure:13669: result: no
configure:13734: checking for bcmp
configure:13790: gcc -o conftest -arch i386 -arch x86_64 -g -Os -pipe -mdynamic-no-pic  -arch i386 -arch x86_64 -L/usr/local/lib conftest.c  -lncurses >&5
conftest.c:85: warning: conflicting types for built-in function 'bcmp'
conftest.c:85: warning: conflicting types for built-in function 'bcmp'
configure:13797: $? = 0
configure:13819: result: yes
configure:13734: checking for fchdir
configure:13790: gcc -o conftest -arch i386 -arch x86_64 -g -Os -pipe -mdynamic-no-pic  -arch i386 -arch x86_64 -L/usr/local/lib conftest.c  -lncurses >&5
configure:13797: $? = 0
configure:13819: result: yes
configure:13734: checking for fchown
configure:13790: gcc -o conftest -arch i386 -arch x86_64 -g -Os -pipe -mdynamic-no-pic  -arch i386 -arch x86_64 -L/usr/local/lib conftest.c  -lncurses >&5
configure:13797: $? = 0
configure:13819: result: yes
configure:13734: checking for fseeko
configure:13790: gcc -o conftest -arch i386 -arch x86_64 -g -Os -pipe -mdynamic-no-pic  -arch i386 -arch x86_64 -L/usr/local/lib conftest.c  -lncurses >&5
configure:13797: $? = 0
configure:13819: result: yes
configure:13734: checking for fsync
configure:13790: gcc -o conftest -arch i386 -arch x86_64 -g -Os -pipe -mdynamic-no-pic  -arch i386 -arch x86_64 -L/usr/local/lib conftest.c  -lncurses >&5
configure:13797: $? = 0
configure:13819: result: yes
configure:13734: checking for ftello
configure:13790: gcc -o conftest -arch i386 -arch x86_64 -g -Os -pipe -mdynamic-no-pic  -arch i386 -arch x86_64 -L/usr/local/lib conftest.c  -lncurses >&5
configure:13797: $? = 0
configure:13819: result: yes
configure:13734: checking for getcwd
configure:13790: gcc -o conftest -arch i386 -arch x86_64 -g -Os -pipe -mdynamic-no-pic  -arch i386 -arch x86_64 -L/usr/local/lib conftest.c  -lncurses >&5
configure:13797: $? = 0
configure:13819: result: yes
configure:13734: checking for getpseudotty
configure:13790: gcc -o conftest -arch i386 -arch x86_64 -g -Os -pipe -mdynamic-no-pic  -arch i386 -arch x86_64 -L/usr/local/lib conftest.c  -lncurses >&5
Undefined symbols for architecture i386:
  "_getpseudotty", referenced from:
      _main in ccSdIP5B.o
ld: symbol(s) not found for architecture i386
collect2: ld returned 1 exit status
Undefined symbols for architecture x86_64:
  "_getpseudotty", referenced from:
      _main in cckaVwMl.o
ld: symbol(s) not found for architecture x86_64
collect2: ld returned 1 exit status
lipo: can't open input file: /var/folders/IQ/IQuL0Q24Fna8hK1dP+jLgU+++TM/-Tmp-//cck9I2RY.out (No such file or directory)
configure:13797: $? = 1
configure: failed program was:
| /* confdefs.h.  */
| #define PACKAGE_NAME ""
| #define PACKAGE_TARNAME ""
| #define PACKAGE_VERSION ""
| #define PACKAGE_STRING ""
| #define PACKAGE_BUGREPORT ""
| #define UNIX 1
| #define STDC_HEADERS 1
| #define HAVE_SYS_WAIT_H 1
| #define FEAT_NORMAL 1
| #define USE_XSMP_INTERACT 1
| #define FEAT_CSCOPE 1
| #define FEAT_NETBEANS_INTG 1
| #define FEAT_MBYTE 1
| #define HAVE_X11_SM_SMLIB_H 1
| #define HAVE_DATE_TIME 1
| #define HAVE_DIRENT_H 1
| #define HAVE_STDARG_H 1
| #define HAVE_STDLIB_H 1
| #define HAVE_STRING_H 1
| #define HAVE_SYS_SELECT_H 1
| #define HAVE_SYS_UTSNAME_H 1
| #define HAVE_TERMCAP_H 1
| #define HAVE_FCNTL_H 1
| #define HAVE_SGTTY_H 1
| #define HAVE_SYS_IOCTL_H 1
| #define HAVE_SYS_TIME_H 1
| #define HAVE_SYS_TYPES_H 1
| #define HAVE_ICONV_H 1
| #define HAVE_LANGINFO_H 1
| #define HAVE_MATH_H 1
| #define HAVE_UNISTD_H 1
| #define HAVE_ERRNO_H 1
| #define HAVE_SYS_RESOURCE_H 1
| #define HAVE_LOCALE_H 1
| #define HAVE_TERMIOS_H 1
| #define HAVE_LIBC_H 1
| #define HAVE_POLL_H 1
| #define HAVE_SYS_POLL_H 1
| #define HAVE_PWD_H 1
| #define HAVE_UTIME_H 1
| #define HAVE_SYS_PARAM_H 1
| #define HAVE_LIBGEN_H 1
| #define HAVE_COPYFILE_H 1
| #define HAVE_SYS_ACL_H 1
| #define HAVE_SYS_SYSCTL_H 1
| #define HAVE_WCHAR_H 1
| #define HAVE_WCTYPE_H 1
| #define HAVE_STRINGS_H 1
| #define TIME_WITH_SYS_TIME 1
| #define TERMINFO 1
| #define HAVE_OSPEED 1
| #define HAVE_UP_BC_PC 1
| #define SYS_SELECT_WITH_SYS_TIME 1
| #define HAVE_SVR4_PTYS 1
| #define PTYRANGE0 "pqrstuvw"
| #define PTYRANGE1 "0123456789abcdef"
| #define RETSIGTYPE void
| #define SIGRETURN return
| #define HAVE_SIGCONTEXT 1
| #define HAVE_BCMP 1
| #define HAVE_FCHDIR 1
| #define HAVE_FCHOWN 1
| #define HAVE_FSEEKO 1
| #define HAVE_FSYNC 1
| #define HAVE_FTELLO 1
| #define HAVE_GETCWD 1
| /* end confdefs.h.  */
| /* Define getpseudotty to an innocuous variant, in case <limits.h> declares getpseudotty.
|    For example, HP-UX 11i <limits.h> declares gettimeofday.  */
| #define getpseudotty innocuous_getpseudotty
| 
| /* System header to define __stub macros and hopefully few prototypes,
|     which can conflict with char getpseudotty (); below.
|     Prefer <limits.h> to <assert.h> if __STDC__ is defined, since
|     <limits.h> exists even on freestanding compilers.  */
| 
| #ifdef __STDC__
| # include <limits.h>
| #else
| # include <assert.h>
| #endif
| 
| #undef getpseudotty
| 
| /* Override any GCC internal prototype to avoid an error.
|    Use char because int might match the return type of a GCC
|    builtin and then its argument prototype would still apply.  */
| #ifdef __cplusplus
| extern "C"
| #endif
| char getpseudotty ();
| /* The GNU C library defines this for functions which it implements
|     to always fail with ENOSYS.  Some functions are actually named
|     something starting with __ and the normal name is an alias.  */
| #if defined __stub_getpseudotty || defined __stub___getpseudotty
| choke me
| #endif
| 
| int
| main ()
| {
| return getpseudotty ();
|   ;
|   return 0;
| }
configure:13819: result: no
configure:13734: checking for getpwnam
configure:13790: gcc -o conftest -arch i386 -arch x86_64 -g -Os -pipe -mdynamic-no-pic  -arch i386 -arch x86_64 -L/usr/local/lib conftest.c  -lncurses >&5
configure:13797: $? = 0
configure:13819: result: yes
configure:13734: checking for getpwuid
configure:13790: gcc -o conftest -arch i386 -arch x86_64 -g -Os -pipe -mdynamic-no-pic  -arch i386 -arch x86_64 -L/usr/local/lib conftest.c  -lncurses >&5
configure:13797: $? = 0
configure:13819: result: yes
configure:13734: checking for getrlimit
configure:13790: gcc -o conftest -arch i386 -arch x86_64 -g -Os -pipe -mdynamic-no-pic  -arch i386 -arch x86_64 -L/usr/local/lib conftest.c  -lncurses >&5
configure:13797: $? = 0
configure:13819: result: yes
configure:13734: checking for gettimeofday
configure:13790: gcc -o conftest -arch i386 -arch x86_64 -g -Os -pipe -mdynamic-no-pic  -arch i386 -arch x86_64 -L/usr/local/lib conftest.c  -lncurses >&5
configure:13797: $? = 0
configure:13819: result: yes
configure:13734: checking for getwd
configure:13790: gcc -o conftest -arch i386 -arch x86_64 -g -Os -pipe -mdynamic-no-pic  -arch i386 -arch x86_64 -L/usr/local/lib conftest.c  -lncurses >&5
configure:13797: $? = 0
configure:13819: result: yes
configure:13734: checking for lstat
configure:13790: gcc -o conftest -arch i386 -arch x86_64 -g -Os -pipe -mdynamic-no-pic  -arch i386 -arch x86_64 -L/usr/local/lib conftest.c  -lncurses >&5
configure:13797: $? = 0
configure:13819: result: yes
configure:13734: checking for memcmp
configure:13790: gcc -o conftest -arch i386 -arch x86_64 -g -Os -pipe -mdynamic-no-pic  -arch i386 -arch x86_64 -L/usr/local/lib conftest.c  -lncurses >&5
conftest.c:98: warning: conflicting types for built-in function 'memcmp'
conftest.c:98: warning: conflicting types for built-in function 'memcmp'
configure:13797: $? = 0
configure:13819: result: yes
configure:13734: checking for memset
configure:13790: gcc -o conftest -arch i386 -arch x86_64 -g -Os -pipe -mdynamic-no-pic  -arch i386 -arch x86_64 -L/usr/local/lib conftest.c  -lncurses >&5
conftest.c:99: warning: conflicting types for built-in function 'memset'
conftest.c:99: warning: conflicting types for built-in function 'memset'
configure:13797: $? = 0
configure:13819: result: yes
configure:13734: checking for nanosleep
configure:13790: gcc -o conftest -arch i386 -arch x86_64 -g -Os -pipe -mdynamic-no-pic  -arch i386 -arch x86_64 -L/usr/local/lib conftest.c  -lncurses >&5
configure:13797: $? = 0
configure:13819: result: yes
configure:13734: checking for opendir
configure:13790: gcc -o conftest -arch i386 -arch x86_64 -g -Os -pipe -mdynamic-no-pic  -arch i386 -arch x86_64 -L/usr/local/lib conftest.c  -lncurses >&5
configure:13797: $? = 0
configure:13819: result: yes
configure:13734: checking for putenv
configure:13790: gcc -o conftest -arch i386 -arch x86_64 -g -Os -pipe -mdynamic-no-pic  -arch i386 -arch x86_64 -L/usr/local/lib conftest.c  -lncurses >&5
configure:13797: $? = 0
configure:13819: result: yes
configure:13734: checking for qsort
configure:13790: gcc -o conftest -arch i386 -arch x86_64 -g -Os -pipe -mdynamic-no-pic  -arch i386 -arch x86_64 -L/usr/local/lib conftest.c  -lncurses >&5
configure:13797: $? = 0
configure:13819: result: yes
configure:13734: checking for readlink
configure:13790: gcc -o conftest -arch i386 -arch x86_64 -g -Os -pipe -mdynamic-no-pic  -arch i386 -arch x86_64 -L/usr/local/lib conftest.c  -lncurses >&5
configure:13797: $? = 0
configure:13819: result: yes
configure:13734: checking for select
configure:13790: gcc -o conftest -arch i386 -arch x86_64 -g -Os -pipe -mdynamic-no-pic  -arch i386 -arch x86_64 -L/usr/local/lib conftest.c  -lncurses >&5
configure:13797: $? = 0
configure:13819: result: yes
configure:13734: checking for setenv
configure:13790: gcc -o conftest -arch i386 -arch x86_64 -g -Os -pipe -mdynamic-no-pic  -arch i386 -arch x86_64 -L/usr/local/lib conftest.c  -lncurses >&5
configure:13797: $? = 0
configure:13819: result: yes
configure:13734: checking for setpgid
configure:13790: gcc -o conftest -arch i386 -arch x86_64 -g -Os -pipe -mdynamic-no-pic  -arch i386 -arch x86_64 -L/usr/local/lib conftest.c  -lncurses >&5
configure:13797: $? = 0
configure:13819: result: yes
configure:13734: checking for setsid
configure:13790: gcc -o conftest -arch i386 -arch x86_64 -g -Os -pipe -mdynamic-no-pic  -arch i386 -arch x86_64 -L/usr/local/lib conftest.c  -lncurses >&5
configure:13797: $? = 0
configure:13819: result: yes
configure:13734: checking for sigaltstack
configure:13790: gcc -o conftest -arch i386 -arch x86_64 -g -Os -pipe -mdynamic-no-pic  -arch i386 -arch x86_64 -L/usr/local/lib conftest.c  -lncurses >&5
configure:13797: $? = 0
configure:13819: result: yes
configure:13734: checking for sigstack
configure:13790: gcc -o conftest -arch i386 -arch x86_64 -g -Os -pipe -mdynamic-no-pic  -arch i386 -arch x86_64 -L/usr/local/lib conftest.c  -lncurses >&5
Undefined symbols for architecture i386:
  "_sigstack", referenced from:
      _main in ccdGMC5Q.o
ld: symbol(s) not found for architecture i386
collect2: ld returned 1 exit status
Undefined symbols for architecture x86_64:
  "_sigstack", referenced from:
      _main in cc40vtTN.o
ld: symbol(s) not found for architecture x86_64
collect2: ld returned 1 exit status
lipo: can't open input file: /var/folders/IQ/IQuL0Q24Fna8hK1dP+jLgU+++TM/-Tmp-//ccCR0h6Y.out (No such file or directory)
configure:13797: $? = 1
configure: failed program was:
| /* confdefs.h.  */
| #define PACKAGE_NAME ""
| #define PACKAGE_TARNAME ""
| #define PACKAGE_VERSION ""
| #define PACKAGE_STRING ""
| #define PACKAGE_BUGREPORT ""
| #define UNIX 1
| #define STDC_HEADERS 1
| #define HAVE_SYS_WAIT_H 1
| #define FEAT_NORMAL 1
| #define USE_XSMP_INTERACT 1
| #define FEAT_CSCOPE 1
| #define FEAT_NETBEANS_INTG 1
| #define FEAT_MBYTE 1
| #define HAVE_X11_SM_SMLIB_H 1
| #define HAVE_DATE_TIME 1
| #define HAVE_DIRENT_H 1
| #define HAVE_STDARG_H 1
| #define HAVE_STDLIB_H 1
| #define HAVE_STRING_H 1
| #define HAVE_SYS_SELECT_H 1
| #define HAVE_SYS_UTSNAME_H 1
| #define HAVE_TERMCAP_H 1
| #define HAVE_FCNTL_H 1
| #define HAVE_SGTTY_H 1
| #define HAVE_SYS_IOCTL_H 1
| #define HAVE_SYS_TIME_H 1
| #define HAVE_SYS_TYPES_H 1
| #define HAVE_ICONV_H 1
| #define HAVE_LANGINFO_H 1
| #define HAVE_MATH_H 1
| #define HAVE_UNISTD_H 1
| #define HAVE_ERRNO_H 1
| #define HAVE_SYS_RESOURCE_H 1
| #define HAVE_LOCALE_H 1
| #define HAVE_TERMIOS_H 1
| #define HAVE_LIBC_H 1
| #define HAVE_POLL_H 1
| #define HAVE_SYS_POLL_H 1
| #define HAVE_PWD_H 1
| #define HAVE_UTIME_H 1
| #define HAVE_SYS_PARAM_H 1
| #define HAVE_LIBGEN_H 1
| #define HAVE_COPYFILE_H 1
| #define HAVE_SYS_ACL_H 1
| #define HAVE_SYS_SYSCTL_H 1
| #define HAVE_WCHAR_H 1
| #define HAVE_WCTYPE_H 1
| #define HAVE_STRINGS_H 1
| #define TIME_WITH_SYS_TIME 1
| #define TERMINFO 1
| #define HAVE_OSPEED 1
| #define HAVE_UP_BC_PC 1
| #define SYS_SELECT_WITH_SYS_TIME 1
| #define HAVE_SVR4_PTYS 1
| #define PTYRANGE0 "pqrstuvw"
| #define PTYRANGE1 "0123456789abcdef"
| #define RETSIGTYPE void
| #define SIGRETURN return
| #define HAVE_SIGCONTEXT 1
| #define HAVE_BCMP 1
| #define HAVE_FCHDIR 1
| #define HAVE_FCHOWN 1
| #define HAVE_FSEEKO 1
| #define HAVE_FSYNC 1
| #define HAVE_FTELLO 1
| #define HAVE_GETCWD 1
| #define HAVE_GETPWNAM 1
| #define HAVE_GETPWUID 1
| #define HAVE_GETRLIMIT 1
| #define HAVE_GETTIMEOFDAY 1
| #define HAVE_GETWD 1
| #define HAVE_LSTAT 1
| #define HAVE_MEMCMP 1
| #define HAVE_MEMSET 1
| #define HAVE_NANOSLEEP 1
| #define HAVE_OPENDIR 1
| #define HAVE_PUTENV 1
| #define HAVE_QSORT 1
| #define HAVE_READLINK 1
| #define HAVE_SELECT 1
| #define HAVE_SETENV 1
| #define HAVE_SETPGID 1
| #define HAVE_SETSID 1
| #define HAVE_SIGALTSTACK 1
| /* end confdefs.h.  */
| /* Define sigstack to an innocuous variant, in case <limits.h> declares sigstack.
|    For example, HP-UX 11i <limits.h> declares gettimeofday.  */
| #define sigstack innocuous_sigstack
| 
| /* System header to define __stub macros and hopefully few prototypes,
|     which can conflict with char sigstack (); below.
|     Prefer <limits.h> to <assert.h> if __STDC__ is defined, since
|     <limits.h> exists even on freestanding compilers.  */
| 
| #ifdef __STDC__
| # include <limits.h>
| #else
| # include <assert.h>
| #endif
| 
| #undef sigstack
| 
| /* Override any GCC internal prototype to avoid an error.
|    Use char because int might match the return type of a GCC
|    builtin and then its argument prototype would still apply.  */
| #ifdef __cplusplus
| extern "C"
| #endif
| char sigstack ();
| /* The GNU C library defines this for functions which it implements
|     to always fail with ENOSYS.  Some functions are actually named
|     something starting with __ and the normal name is an alias.  */
| #if defined __stub_sigstack || defined __stub___sigstack
| choke me
| #endif
| 
| int
| main ()
| {
| return sigstack ();
|   ;
|   return 0;
| }
configure:13819: result: no
configure:13734: checking for sigset
configure:13790: gcc -o conftest -arch i386 -arch x86_64 -g -Os -pipe -mdynamic-no-pic  -arch i386 -arch x86_64 -L/usr/local/lib conftest.c  -lncurses >&5
configure:13797: $? = 0
configure:13819: result: yes
configure:13734: checking for sigsetjmp
configure:13790: gcc -o conftest -arch i386 -arch x86_64 -g -Os -pipe -mdynamic-no-pic  -arch i386 -arch x86_64 -L/usr/local/lib conftest.c  -lncurses >&5
configure:13797: $? = 0
configure:13819: result: yes
configure:13734: checking for sigaction
configure:13790: gcc -o conftest -arch i386 -arch x86_64 -g -Os -pipe -mdynamic-no-pic  -arch i386 -arch x86_64 -L/usr/local/lib conftest.c  -lncurses >&5
configure:13797: $? = 0
configure:13819: result: yes
configure:13734: checking for sigvec
configure:13790: gcc -o conftest -arch i386 -arch x86_64 -g -Os -pipe -mdynamic-no-pic  -arch i386 -arch x86_64 -L/usr/local/lib conftest.c  -lncurses >&5
configure:13797: $? = 0
configure:13819: result: yes
configure:13734: checking for strcasecmp
configure:13790: gcc -o conftest -arch i386 -arch x86_64 -g -Os -pipe -mdynamic-no-pic  -arch i386 -arch x86_64 -L/usr/local/lib conftest.c  -lncurses >&5
conftest.c:114: warning: conflicting types for built-in function 'strcasecmp'
conftest.c:114: warning: conflicting types for built-in function 'strcasecmp'
configure:13797: $? = 0
configure:13819: result: yes
configure:13734: checking for strerror
configure:13790: gcc -o conftest -arch i386 -arch x86_64 -g -Os -pipe -mdynamic-no-pic  -arch i386 -arch x86_64 -L/usr/local/lib conftest.c  -lncurses >&5
configure:13797: $? = 0
configure:13819: result: yes
configure:13734: checking for strftime
configure:13790: gcc -o conftest -arch i386 -arch x86_64 -g -Os -pipe -mdynamic-no-pic  -arch i386 -arch x86_64 -L/usr/local/lib conftest.c  -lncurses >&5
conftest.c:116: warning: conflicting types for built-in function 'strftime'
conftest.c:116: warning: conflicting types for built-in function 'strftime'
configure:13797: $? = 0
configure:13819: result: yes
configure:13734: checking for stricmp
configure:13790: gcc -o conftest -arch i386 -arch x86_64 -g -Os -pipe -mdynamic-no-pic  -arch i386 -arch x86_64 -L/usr/local/lib conftest.c  -lncurses >&5
Undefined symbols for architecture i386:
  "_stricmp", referenced from:
      _main in ccUwh7hb.o
ld: symbol(s) not found for architecture i386
collect2: ld returned 1 exit status
Undefined symbols for architecture x86_64:
  "_stricmp", referenced from:
      _main in cc6PcAzP.o
ld: symbol(s) not found for architecture x86_64
collect2: ld returned 1 exit status
lipo: can't open input file: /var/folders/IQ/IQuL0Q24Fna8hK1dP+jLgU+++TM/-Tmp-//cchk1Ysv.out (No such file or directory)
configure:13797: $? = 1
configure: failed program was:
| /* confdefs.h.  */
| #define PACKAGE_NAME ""
| #define PACKAGE_TARNAME ""
| #define PACKAGE_VERSION ""
| #define PACKAGE_STRING ""
| #define PACKAGE_BUGREPORT ""
| #define UNIX 1
| #define STDC_HEADERS 1
| #define HAVE_SYS_WAIT_H 1
| #define FEAT_NORMAL 1
| #define USE_XSMP_INTERACT 1
| #define FEAT_CSCOPE 1
| #define FEAT_NETBEANS_INTG 1
| #define FEAT_MBYTE 1
| #define HAVE_X11_SM_SMLIB_H 1
| #define HAVE_DATE_TIME 1
| #define HAVE_DIRENT_H 1
| #define HAVE_STDARG_H 1
| #define HAVE_STDLIB_H 1
| #define HAVE_STRING_H 1
| #define HAVE_SYS_SELECT_H 1
| #define HAVE_SYS_UTSNAME_H 1
| #define HAVE_TERMCAP_H 1
| #define HAVE_FCNTL_H 1
| #define HAVE_SGTTY_H 1
| #define HAVE_SYS_IOCTL_H 1
| #define HAVE_SYS_TIME_H 1
| #define HAVE_SYS_TYPES_H 1
| #define HAVE_ICONV_H 1
| #define HAVE_LANGINFO_H 1
| #define HAVE_MATH_H 1
| #define HAVE_UNISTD_H 1
| #define HAVE_ERRNO_H 1
| #define HAVE_SYS_RESOURCE_H 1
| #define HAVE_LOCALE_H 1
| #define HAVE_TERMIOS_H 1
| #define HAVE_LIBC_H 1
| #define HAVE_POLL_H 1
| #define HAVE_SYS_POLL_H 1
| #define HAVE_PWD_H 1
| #define HAVE_UTIME_H 1
| #define HAVE_SYS_PARAM_H 1
| #define HAVE_LIBGEN_H 1
| #define HAVE_COPYFILE_H 1
| #define HAVE_SYS_ACL_H 1
| #define HAVE_SYS_SYSCTL_H 1
| #define HAVE_WCHAR_H 1
| #define HAVE_WCTYPE_H 1
| #define HAVE_STRINGS_H 1
| #define TIME_WITH_SYS_TIME 1
| #define TERMINFO 1
| #define HAVE_OSPEED 1
| #define HAVE_UP_BC_PC 1
| #define SYS_SELECT_WITH_SYS_TIME 1
| #define HAVE_SVR4_PTYS 1
| #define PTYRANGE0 "pqrstuvw"
| #define PTYRANGE1 "0123456789abcdef"
| #define RETSIGTYPE void
| #define SIGRETURN return
| #define HAVE_SIGCONTEXT 1
| #define HAVE_BCMP 1
| #define HAVE_FCHDIR 1
| #define HAVE_FCHOWN 1
| #define HAVE_FSEEKO 1
| #define HAVE_FSYNC 1
| #define HAVE_FTELLO 1
| #define HAVE_GETCWD 1
| #define HAVE_GETPWNAM 1
| #define HAVE_GETPWUID 1
| #define HAVE_GETRLIMIT 1
| #define HAVE_GETTIMEOFDAY 1
| #define HAVE_GETWD 1
| #define HAVE_LSTAT 1
| #define HAVE_MEMCMP 1
| #define HAVE_MEMSET 1
| #define HAVE_NANOSLEEP 1
| #define HAVE_OPENDIR 1
| #define HAVE_PUTENV 1
| #define HAVE_QSORT 1
| #define HAVE_READLINK 1
| #define HAVE_SELECT 1
| #define HAVE_SETENV 1
| #define HAVE_SETPGID 1
| #define HAVE_SETSID 1
| #define HAVE_SIGALTSTACK 1
| #define HAVE_SIGSET 1
| #define HAVE_SIGSETJMP 1
| #define HAVE_SIGACTION 1
| #define HAVE_SIGVEC 1
| #define HAVE_STRCASECMP 1
| #define HAVE_STRERROR 1
| #define HAVE_STRFTIME 1
| /* end confdefs.h.  */
| /* Define stricmp to an innocuous variant, in case <limits.h> declares stricmp.
|    For example, HP-UX 11i <limits.h> declares gettimeofday.  */
| #define stricmp innocuous_stricmp
| 
| /* System header to define __stub macros and hopefully few prototypes,
|     which can conflict with char stricmp (); below.
|     Prefer <limits.h> to <assert.h> if __STDC__ is defined, since
|     <limits.h> exists even on freestanding compilers.  */
| 
| #ifdef __STDC__
| # include <limits.h>
| #else
| # include <assert.h>
| #endif
| 
| #undef stricmp
| 
| /* Override any GCC internal prototype to avoid an error.
|    Use char because int might match the return type of a GCC
|    builtin and then its argument prototype would still apply.  */
| #ifdef __cplusplus
| extern "C"
| #endif
| char stricmp ();
| /* The GNU C library defines this for functions which it implements
|     to always fail with ENOSYS.  Some functions are actually named
|     something starting with __ and the normal name is an alias.  */
| #if defined __stub_stricmp || defined __stub___stricmp
| choke me
| #endif
| 
| int
| main ()
| {
| return stricmp ();
|   ;
|   return 0;
| }
configure:13819: result: no
configure:13734: checking for strncasecmp
configure:13790: gcc -o conftest -arch i386 -arch x86_64 -g -Os -pipe -mdynamic-no-pic  -arch i386 -arch x86_64 -L/usr/local/lib conftest.c  -lncurses >&5
conftest.c:117: warning: conflicting types for built-in function 'strncasecmp'
conftest.c:117: warning: conflicting types for built-in function 'strncasecmp'
configure:13797: $? = 0
configure:13819: result: yes
configure:13734: checking for strnicmp
configure:13790: gcc -o conftest -arch i386 -arch x86_64 -g -Os -pipe -mdynamic-no-pic  -arch i386 -arch x86_64 -L/usr/local/lib conftest.c  -lncurses >&5
Undefined symbols for architecture i386:
  "_strnicmp", referenced from:
      _main in ccAZIiaL.o
ld: symbol(s) not found for architecture i386
collect2: ld returned 1 exit status
Undefined symbols for architecture x86_64:
  "_strnicmp", referenced from:
      _main in ccCz8bIa.o
ld: symbol(s) not found for architecture x86_64
collect2: ld returned 1 exit status
lipo: can't open input file: /var/folders/IQ/IQuL0Q24Fna8hK1dP+jLgU+++TM/-Tmp-//ccYfzS7L.out (No such file or directory)
configure:13797: $? = 1
configure: failed program was:
| /* confdefs.h.  */
| #define PACKAGE_NAME ""
| #define PACKAGE_TARNAME ""
| #define PACKAGE_VERSION ""
| #define PACKAGE_STRING ""
| #define PACKAGE_BUGREPORT ""
| #define UNIX 1
| #define STDC_HEADERS 1
| #define HAVE_SYS_WAIT_H 1
| #define FEAT_NORMAL 1
| #define USE_XSMP_INTERACT 1
| #define FEAT_CSCOPE 1
| #define FEAT_NETBEANS_INTG 1
| #define FEAT_MBYTE 1
| #define HAVE_X11_SM_SMLIB_H 1
| #define HAVE_DATE_TIME 1
| #define HAVE_DIRENT_H 1
| #define HAVE_STDARG_H 1
| #define HAVE_STDLIB_H 1
| #define HAVE_STRING_H 1
| #define HAVE_SYS_SELECT_H 1
| #define HAVE_SYS_UTSNAME_H 1
| #define HAVE_TERMCAP_H 1
| #define HAVE_FCNTL_H 1
| #define HAVE_SGTTY_H 1
| #define HAVE_SYS_IOCTL_H 1
| #define HAVE_SYS_TIME_H 1
| #define HAVE_SYS_TYPES_H 1
| #define HAVE_ICONV_H 1
| #define HAVE_LANGINFO_H 1
| #define HAVE_MATH_H 1
| #define HAVE_UNISTD_H 1
| #define HAVE_ERRNO_H 1
| #define HAVE_SYS_RESOURCE_H 1
| #define HAVE_LOCALE_H 1
| #define HAVE_TERMIOS_H 1
| #define HAVE_LIBC_H 1
| #define HAVE_POLL_H 1
| #define HAVE_SYS_POLL_H 1
| #define HAVE_PWD_H 1
| #define HAVE_UTIME_H 1
| #define HAVE_SYS_PARAM_H 1
| #define HAVE_LIBGEN_H 1
| #define HAVE_COPYFILE_H 1
| #define HAVE_SYS_ACL_H 1
| #define HAVE_SYS_SYSCTL_H 1
| #define HAVE_WCHAR_H 1
| #define HAVE_WCTYPE_H 1
| #define HAVE_STRINGS_H 1
| #define TIME_WITH_SYS_TIME 1
| #define TERMINFO 1
| #define HAVE_OSPEED 1
| #define HAVE_UP_BC_PC 1
| #define SYS_SELECT_WITH_SYS_TIME 1
| #define HAVE_SVR4_PTYS 1
| #define PTYRANGE0 "pqrstuvw"
| #define PTYRANGE1 "0123456789abcdef"
| #define RETSIGTYPE void
| #define SIGRETURN return
| #define HAVE_SIGCONTEXT 1
| #define HAVE_BCMP 1
| #define HAVE_FCHDIR 1
| #define HAVE_FCHOWN 1
| #define HAVE_FSEEKO 1
| #define HAVE_FSYNC 1
| #define HAVE_FTELLO 1
| #define HAVE_GETCWD 1
| #define HAVE_GETPWNAM 1
| #define HAVE_GETPWUID 1
| #define HAVE_GETRLIMIT 1
| #define HAVE_GETTIMEOFDAY 1
| #define HAVE_GETWD 1
| #define HAVE_LSTAT 1
| #define HAVE_MEMCMP 1
| #define HAVE_MEMSET 1
| #define HAVE_NANOSLEEP 1
| #define HAVE_OPENDIR 1
| #define HAVE_PUTENV 1
| #define HAVE_QSORT 1
| #define HAVE_READLINK 1
| #define HAVE_SELECT 1
| #define HAVE_SETENV 1
| #define HAVE_SETPGID 1
| #define HAVE_SETSID 1
| #define HAVE_SIGALTSTACK 1
| #define HAVE_SIGSET 1
| #define HAVE_SIGSETJMP 1
| #define HAVE_SIGACTION 1
| #define HAVE_SIGVEC 1
| #define HAVE_STRCASECMP 1
| #define HAVE_STRERROR 1
| #define HAVE_STRFTIME 1
| #define HAVE_STRNCASECMP 1
| /* end confdefs.h.  */
| /* Define strnicmp to an innocuous variant, in case <limits.h> declares strnicmp.
|    For example, HP-UX 11i <limits.h> declares gettimeofday.  */
| #define strnicmp innocuous_strnicmp
| 
| /* System header to define __stub macros and hopefully few prototypes,
|     which can conflict with char strnicmp (); below.
|     Prefer <limits.h> to <assert.h> if __STDC__ is defined, since
|     <limits.h> exists even on freestanding compilers.  */
| 
| #ifdef __STDC__
| # include <limits.h>
| #else
| # include <assert.h>
| #endif
| 
| #undef strnicmp
| 
| /* Override any GCC internal prototype to avoid an error.
|    Use char because int might match the return type of a GCC
|    builtin and then its argument prototype would still apply.  */
| #ifdef __cplusplus
| extern "C"
| #endif
| char strnicmp ();
| /* The GNU C library defines this for functions which it implements
|     to always fail with ENOSYS.  Some functions are actually named
|     something starting with __ and the normal name is an alias.  */
| #if defined __stub_strnicmp || defined __stub___strnicmp
| choke me
| #endif
| 
| int
| main ()
| {
| return strnicmp ();
|   ;
|   return 0;
| }
configure:13819: result: no
configure:13734: checking for strpbrk
configure:13790: gcc -o conftest -arch i386 -arch x86_64 -g -Os -pipe -mdynamic-no-pic  -arch i386 -arch x86_64 -L/usr/local/lib conftest.c  -lncurses >&5
conftest.c:118: warning: conflicting types for built-in function 'strpbrk'
conftest.c:118: warning: conflicting types for built-in function 'strpbrk'
configure:13797: $? = 0
configure:13819: result: yes
configure:13734: checking for strtol
configure:13790: gcc -o conftest -arch i386 -arch x86_64 -g -Os -pipe -mdynamic-no-pic  -arch i386 -arch x86_64 -L/usr/local/lib conftest.c  -lncurses >&5
configure:13797: $? = 0
configure:13819: result: yes
configure:13734: checking for tgetent
configure:13790: gcc -o conftest -arch i386 -arch x86_64 -g -Os -pipe -mdynamic-no-pic  -arch i386 -arch x86_64 -L/usr/local/lib conftest.c  -lncurses >&5
configure:13797: $? = 0
configure:13819: result: yes
configure:13734: checking for towlower
configure:13790: gcc -o conftest -arch i386 -arch x86_64 -g -Os -pipe -mdynamic-no-pic  -arch i386 -arch x86_64 -L/usr/local/lib conftest.c  -lncurses >&5
conftest.c:121: warning: conflicting types for built-in function 'towlower'
conftest.c:121: warning: conflicting types for built-in function 'towlower'
configure:13797: $? = 0
configure:13819: result: yes
configure:13734: checking for towupper
configure:13790: gcc -o conftest -arch i386 -arch x86_64 -g -Os -pipe -mdynamic-no-pic  -arch i386 -arch x86_64 -L/usr/local/lib conftest.c  -lncurses >&5
conftest.c:122: warning: conflicting types for built-in function 'towupper'
conftest.c:122: warning: conflicting types for built-in function 'towupper'
configure:13797: $? = 0
configure:13819: result: yes
configure:13734: checking for iswupper
configure:13790: gcc -o conftest -arch i386 -arch x86_64 -g -Os -pipe -mdynamic-no-pic  -arch i386 -arch x86_64 -L/usr/local/lib conftest.c  -lncurses >&5
conftest.c:123: warning: conflicting types for built-in function 'iswupper'
conftest.c:123: warning: conflicting types for built-in function 'iswupper'
configure:13797: $? = 0
configure:13819: result: yes
configure:13734: checking for usleep
configure:13790: gcc -o conftest -arch i386 -arch x86_64 -g -Os -pipe -mdynamic-no-pic  -arch i386 -arch x86_64 -L/usr/local/lib conftest.c  -lncurses >&5
configure:13797: $? = 0
configure:13819: result: yes
configure:13734: checking for utime
configure:13790: gcc -o conftest -arch i386 -arch x86_64 -g -Os -pipe -mdynamic-no-pic  -arch i386 -arch x86_64 -L/usr/local/lib conftest.c  -lncurses >&5
configure:13797: $? = 0
configure:13819: result: yes
configure:13734: checking for utimes
configure:13790: gcc -o conftest -arch i386 -arch x86_64 -g -Os -pipe -mdynamic-no-pic  -arch i386 -arch x86_64 -L/usr/local/lib conftest.c  -lncurses >&5
configure:13797: $? = 0
configure:13819: result: yes
configure:13734: checking for copyfile
configure:13790: gcc -o conftest -arch i386 -arch x86_64 -g -Os -pipe -mdynamic-no-pic  -arch i386 -arch x86_64 -L/usr/local/lib conftest.c  -lncurses >&5
configure:13797: $? = 0
configure:13819: result: yes
configure:13831: checking for st_blksize
configure:13859: gcc -c -arch i386 -arch x86_64 -g -Os -pipe -mdynamic-no-pic  conftest.c >&5
configure:13866: $? = 0
configure:13871: result: yes
configure:13886: checking whether stat() ignores a trailing slash
configure:13917: gcc -o conftest -arch i386 -arch x86_64 -g -Os -pipe -mdynamic-no-pic  -arch i386 -arch x86_64 -L/usr/local/lib conftest.c  -lncurses >&5
configure:13921: $? = 0
configure:13927: ./conftest
configure:13931: $? = 1
configure: program exited with status 1
configure: failed program was:
| 
| #include "confdefs.h"
| #if STDC_HEADERS
| # include <stdlib.h>
| # include <stddef.h>
| #endif
| #include <sys/types.h>
| #include <sys/stat.h>
| main() {struct stat st;  exit(stat("configure/", &st) != 0); }
| 
configure:13953: result: no
configure:13963: checking for iconv_open()
configure:13992: gcc -o conftest -arch i386 -arch x86_64 -g -Os -pipe -mdynamic-no-pic  -arch i386 -arch x86_64 -L/usr/local/lib conftest.c  -lncurses -liconv >&5
configure:13999: $? = 0
configure:14007: result: yes; with -liconv
configure:14080: checking for nl_langinfo(CODESET)
configure:14107: gcc -o conftest -arch i386 -arch x86_64 -g -Os -pipe -mdynamic-no-pic  -arch i386 -arch x86_64 -L/usr/local/lib conftest.c  -lncurses -liconv >&5
configure:14114: $? = 0
configure:14122: result: yes
configure:14140: checking for strtod in -lm
configure:14175: gcc -o conftest -arch i386 -arch x86_64 -g -Os -pipe -mdynamic-no-pic  -arch i386 -arch x86_64 -L/usr/local/lib conftest.c -lm   -lncurses -liconv >&5
configure:14182: $? = 0
configure:14203: result: yes
configure:14214: checking for strtod() and other floating point functions
configure:14256: gcc -o conftest -arch i386 -arch x86_64 -g -Os -pipe -mdynamic-no-pic  -arch i386 -arch x86_64 -L/usr/local/lib conftest.c -lm  -lncurses -liconv >&5
configure:14263: $? = 0
configure:14271: result: yes
configure:14288: checking --disable-acl argument
configure:14298: result: no
configure:14300: checking for acl_get_file in -lposix1e
configure:14335: gcc -o conftest -arch i386 -arch x86_64 -g -Os -pipe -mdynamic-no-pic  -arch i386 -arch x86_64 -L/usr/local/lib conftest.c -lposix1e  -lm  -lncurses -liconv >&5
ld: library not found for -lposix1e
collect2: ld returned 1 exit status
ld: library not found for -lposix1e
collect2: ld returned 1 exit status
lipo: can't open input file: /var/folders/IQ/IQuL0Q24Fna8hK1dP+jLgU+++TM/-Tmp-//ccwxoQ2t.out (No such file or directory)
configure:14342: $? = 1
configure: failed program was:
| /* confdefs.h.  */
| #define PACKAGE_NAME ""
| #define PACKAGE_TARNAME ""
| #define PACKAGE_VERSION ""
| #define PACKAGE_STRING ""
| #define PACKAGE_BUGREPORT ""
| #define UNIX 1
| #define STDC_HEADERS 1
| #define HAVE_SYS_WAIT_H 1
| #define FEAT_NORMAL 1
| #define USE_XSMP_INTERACT 1
| #define FEAT_CSCOPE 1
| #define FEAT_NETBEANS_INTG 1
| #define FEAT_MBYTE 1
| #define HAVE_X11_SM_SMLIB_H 1
| #define HAVE_DATE_TIME 1
| #define HAVE_DIRENT_H 1
| #define HAVE_STDARG_H 1
| #define HAVE_STDLIB_H 1
| #define HAVE_STRING_H 1
| #define HAVE_SYS_SELECT_H 1
| #define HAVE_SYS_UTSNAME_H 1
| #define HAVE_TERMCAP_H 1
| #define HAVE_FCNTL_H 1
| #define HAVE_SGTTY_H 1
| #define HAVE_SYS_IOCTL_H 1
| #define HAVE_SYS_TIME_H 1
| #define HAVE_SYS_TYPES_H 1
| #define HAVE_ICONV_H 1
| #define HAVE_LANGINFO_H 1
| #define HAVE_MATH_H 1
| #define HAVE_UNISTD_H 1
| #define HAVE_ERRNO_H 1
| #define HAVE_SYS_RESOURCE_H 1
| #define HAVE_LOCALE_H 1
| #define HAVE_TERMIOS_H 1
| #define HAVE_LIBC_H 1
| #define HAVE_POLL_H 1
| #define HAVE_SYS_POLL_H 1
| #define HAVE_PWD_H 1
| #define HAVE_UTIME_H 1
| #define HAVE_SYS_PARAM_H 1
| #define HAVE_LIBGEN_H 1
| #define HAVE_COPYFILE_H 1
| #define HAVE_SYS_ACL_H 1
| #define HAVE_SYS_SYSCTL_H 1
| #define HAVE_WCHAR_H 1
| #define HAVE_WCTYPE_H 1
| #define HAVE_STRINGS_H 1
| #define TIME_WITH_SYS_TIME 1
| #define TERMINFO 1
| #define HAVE_OSPEED 1
| #define HAVE_UP_BC_PC 1
| #define SYS_SELECT_WITH_SYS_TIME 1
| #define HAVE_SVR4_PTYS 1
| #define PTYRANGE0 "pqrstuvw"
| #define PTYRANGE1 "0123456789abcdef"
| #define RETSIGTYPE void
| #define SIGRETURN return
| #define HAVE_SIGCONTEXT 1
| #define HAVE_BCMP 1
| #define HAVE_FCHDIR 1
| #define HAVE_FCHOWN 1
| #define HAVE_FSEEKO 1
| #define HAVE_FSYNC 1
| #define HAVE_FTELLO 1
| #define HAVE_GETCWD 1
| #define HAVE_GETPWNAM 1
| #define HAVE_GETPWUID 1
| #define HAVE_GETRLIMIT 1
| #define HAVE_GETTIMEOFDAY 1
| #define HAVE_GETWD 1
| #define HAVE_LSTAT 1
| #define HAVE_MEMCMP 1
| #define HAVE_MEMSET 1
| #define HAVE_NANOSLEEP 1
| #define HAVE_OPENDIR 1
| #define HAVE_PUTENV 1
| #define HAVE_QSORT 1
| #define HAVE_READLINK 1
| #define HAVE_SELECT 1
| #define HAVE_SETENV 1
| #define HAVE_SETPGID 1
| #define HAVE_SETSID 1
| #define HAVE_SIGALTSTACK 1
| #define HAVE_SIGSET 1
| #define HAVE_SIGSETJMP 1
| #define HAVE_SIGACTION 1
| #define HAVE_SIGVEC 1
| #define HAVE_STRCASECMP 1
| #define HAVE_STRERROR 1
| #define HAVE_STRFTIME 1
| #define HAVE_STRNCASECMP 1
| #define HAVE_STRPBRK 1
| #define HAVE_STRTOL 1
| #define HAVE_TGETENT 1
| #define HAVE_TOWLOWER 1
| #define HAVE_TOWUPPER 1
| #define HAVE_ISWUPPER 1
| #define HAVE_USLEEP 1
| #define HAVE_UTIME 1
| #define HAVE_UTIMES 1
| #define HAVE_COPYFILE 1
| #define HAVE_ST_BLKSIZE 1
| #define HAVE_ICONV 1
| #define HAVE_NL_LANGINFO_CODESET 1
| #define HAVE_LIBM 1
| #define HAVE_FLOAT_FUNCS 1
| /* end confdefs.h.  */
| 
| /* Override any GCC internal prototype to avoid an error.
|    Use char because int might match the return type of a GCC
|    builtin and then its argument prototype would still apply.  */
| #ifdef __cplusplus
| extern "C"
| #endif
| char acl_get_file ();
| int
| main ()
| {
| return acl_get_file ();
|   ;
|   return 0;
| }
configure:14363: result: no
configure:14368: checking for acl_get_file in -lacl
configure:14403: gcc -o conftest -arch i386 -arch x86_64 -g -Os -pipe -mdynamic-no-pic  -arch i386 -arch x86_64 -L/usr/local/lib conftest.c -lacl  -lm  -lncurses -liconv >&5
ld: library not found for -lacl
collect2: ld returned 1 exit status
ld: library not found for -lacl
collect2: ld returned 1 exit status
lipo: can't open input file: /var/folders/IQ/IQuL0Q24Fna8hK1dP+jLgU+++TM/-Tmp-//cclgHtwf.out (No such file or directory)
configure:14410: $? = 1
configure: failed program was:
| /* confdefs.h.  */
| #define PACKAGE_NAME ""
| #define PACKAGE_TARNAME ""
| #define PACKAGE_VERSION ""
| #define PACKAGE_STRING ""
| #define PACKAGE_BUGREPORT ""
| #define UNIX 1
| #define STDC_HEADERS 1
| #define HAVE_SYS_WAIT_H 1
| #define FEAT_NORMAL 1
| #define USE_XSMP_INTERACT 1
| #define FEAT_CSCOPE 1
| #define FEAT_NETBEANS_INTG 1
| #define FEAT_MBYTE 1
| #define HAVE_X11_SM_SMLIB_H 1
| #define HAVE_DATE_TIME 1
| #define HAVE_DIRENT_H 1
| #define HAVE_STDARG_H 1
| #define HAVE_STDLIB_H 1
| #define HAVE_STRING_H 1
| #define HAVE_SYS_SELECT_H 1
| #define HAVE_SYS_UTSNAME_H 1
| #define HAVE_TERMCAP_H 1
| #define HAVE_FCNTL_H 1
| #define HAVE_SGTTY_H 1
| #define HAVE_SYS_IOCTL_H 1
| #define HAVE_SYS_TIME_H 1
| #define HAVE_SYS_TYPES_H 1
| #define HAVE_ICONV_H 1
| #define HAVE_LANGINFO_H 1
| #define HAVE_MATH_H 1
| #define HAVE_UNISTD_H 1
| #define HAVE_ERRNO_H 1
| #define HAVE_SYS_RESOURCE_H 1
| #define HAVE_LOCALE_H 1
| #define HAVE_TERMIOS_H 1
| #define HAVE_LIBC_H 1
| #define HAVE_POLL_H 1
| #define HAVE_SYS_POLL_H 1
| #define HAVE_PWD_H 1
| #define HAVE_UTIME_H 1
| #define HAVE_SYS_PARAM_H 1
| #define HAVE_LIBGEN_H 1
| #define HAVE_COPYFILE_H 1
| #define HAVE_SYS_ACL_H 1
| #define HAVE_SYS_SYSCTL_H 1
| #define HAVE_WCHAR_H 1
| #define HAVE_WCTYPE_H 1
| #define HAVE_STRINGS_H 1
| #define TIME_WITH_SYS_TIME 1
| #define TERMINFO 1
| #define HAVE_OSPEED 1
| #define HAVE_UP_BC_PC 1
| #define SYS_SELECT_WITH_SYS_TIME 1
| #define HAVE_SVR4_PTYS 1
| #define PTYRANGE0 "pqrstuvw"
| #define PTYRANGE1 "0123456789abcdef"
| #define RETSIGTYPE void
| #define SIGRETURN return
| #define HAVE_SIGCONTEXT 1
| #define HAVE_BCMP 1
| #define HAVE_FCHDIR 1
| #define HAVE_FCHOWN 1
| #define HAVE_FSEEKO 1
| #define HAVE_FSYNC 1
| #define HAVE_FTELLO 1
| #define HAVE_GETCWD 1
| #define HAVE_GETPWNAM 1
| #define HAVE_GETPWUID 1
| #define HAVE_GETRLIMIT 1
| #define HAVE_GETTIMEOFDAY 1
| #define HAVE_GETWD 1
| #define HAVE_LSTAT 1
| #define HAVE_MEMCMP 1
| #define HAVE_MEMSET 1
| #define HAVE_NANOSLEEP 1
| #define HAVE_OPENDIR 1
| #define HAVE_PUTENV 1
| #define HAVE_QSORT 1
| #define HAVE_READLINK 1
| #define HAVE_SELECT 1
| #define HAVE_SETENV 1
| #define HAVE_SETPGID 1
| #define HAVE_SETSID 1
| #define HAVE_SIGALTSTACK 1
| #define HAVE_SIGSET 1
| #define HAVE_SIGSETJMP 1
| #define HAVE_SIGACTION 1
| #define HAVE_SIGVEC 1
| #define HAVE_STRCASECMP 1
| #define HAVE_STRERROR 1
| #define HAVE_STRFTIME 1
| #define HAVE_STRNCASECMP 1
| #define HAVE_STRPBRK 1
| #define HAVE_STRTOL 1
| #define HAVE_TGETENT 1
| #define HAVE_TOWLOWER 1
| #define HAVE_TOWUPPER 1
| #define HAVE_ISWUPPER 1
| #define HAVE_USLEEP 1
| #define HAVE_UTIME 1
| #define HAVE_UTIMES 1
| #define HAVE_COPYFILE 1
| #define HAVE_ST_BLKSIZE 1
| #define HAVE_ICONV 1
| #define HAVE_NL_LANGINFO_CODESET 1
| #define HAVE_LIBM 1
| #define HAVE_FLOAT_FUNCS 1
| /* end confdefs.h.  */
| 
| /* Override any GCC internal prototype to avoid an error.
|    Use char because int might match the return type of a GCC
|    builtin and then its argument prototype would still apply.  */
| #ifdef __cplusplus
| extern "C"
| #endif
| char acl_get_file ();
| int
| main ()
| {
| return acl_get_file ();
|   ;
|   return 0;
| }
configure:14431: result: no
configure:14509: checking for POSIX ACL support
configure:14539: gcc -o conftest -arch i386 -arch x86_64 -g -Os -pipe -mdynamic-no-pic  -arch i386 -arch x86_64 -L/usr/local/lib conftest.c -lm  -lncurses -liconv >&5
configure:14546: $? = 0
configure:14554: result: yes
configure:14571: checking for Solaris ACL support
configure:14598: gcc -o conftest -arch i386 -arch x86_64 -g -Os -pipe -mdynamic-no-pic  -arch i386 -arch x86_64 -L/usr/local/lib conftest.c -lm  -lncurses -liconv >&5
In file included from /usr/include/sys/acl.h:26,
                 from conftest.c:113:
/usr/include/sys/kauth.h:65: error: expected specifier-qualifier-list before 'u_int8_t'
/usr/include/sys/kauth.h:86: error: expected specifier-qualifier-list before 'u_int32_t'
/usr/include/sys/kauth.h:140: error: expected '=', ',', ';', 'asm' or '__attribute__' before 'kauth_ace_rights_t'
/usr/include/sys/kauth.h:145: error: expected specifier-qualifier-list before 'u_int32_t'
/usr/include/sys/kauth.h:181: error: expected specifier-qualifier-list before 'u_int32_t'
/usr/include/sys/kauth.h:236: error: expected specifier-qualifier-list before 'u_int32_t'
In file included from conftest.c:113:
/usr/include/sys/acl.h:163: error: expected '=', ',', ';', 'asm' or '__attribute__' before 'acl_copy_ext'
/usr/include/sys/acl.h:164: error: expected '=', ',', ';', 'asm' or '__attribute__' before 'acl_copy_ext_native'
/usr/include/sys/acl.h:168: error: expected '=', ',', ';', 'asm' or '__attribute__' before 'acl_size'
/usr/include/sys/acl.h:169: error: expected declaration specifiers or '...' before 'ssize_t'
conftest.c: In function 'main':
conftest.c:118: error: 'GETACLCNT' undeclared (first use in this function)
conftest.c:118: error: (Each undeclared identifier is reported only once
conftest.c:118: error: for each function it appears in.)
conftest.c:118: error: 'NULL' undeclared (first use in this function)
In file included from /usr/include/sys/acl.h:26,
                 from conftest.c:113:
/usr/include/sys/kauth.h:65: error: expected specifier-qualifier-list before 'u_int8_t'
/usr/include/sys/kauth.h:86: error: expected specifier-qualifier-list before 'u_int32_t'
/usr/include/sys/kauth.h:140: error: expected '=', ',', ';', 'asm' or '__attribute__' before 'kauth_ace_rights_t'
/usr/include/sys/kauth.h:145: error: expected specifier-qualifier-list before 'u_int32_t'
/usr/include/sys/kauth.h:181: error: expected specifier-qualifier-list before 'u_int32_t'
/usr/include/sys/kauth.h:236: error: expected specifier-qualifier-list before 'u_int32_t'
In file included from conftest.c:113:
/usr/include/sys/acl.h:163: error: expected '=', ',', ';', 'asm' or '__attribute__' before 'acl_copy_ext'
/usr/include/sys/acl.h:164: error: expected '=', ',', ';', 'asm' or '__attribute__' before 'acl_copy_ext_native'
/usr/include/sys/acl.h:168: error: expected '=', ',', ';', 'asm' or '__attribute__' before 'acl_size'
/usr/include/sys/acl.h:169: error: expected declaration specifiers or '...' before 'ssize_t'
conftest.c: In function 'main':
conftest.c:118: error: 'GETACLCNT' undeclared (first use in this function)
conftest.c:118: error: (Each undeclared identifier is reported only once
conftest.c:118: error: for each function it appears in.)
conftest.c:118: error: 'NULL' undeclared (first use in this function)
lipo: can't figure out the architecture type of: /var/folders/IQ/IQuL0Q24Fna8hK1dP+jLgU+++TM/-Tmp-//ccNQWGq4.out
configure:14605: $? = 1
configure: failed program was:
| /* confdefs.h.  */
| #define PACKAGE_NAME ""
| #define PACKAGE_TARNAME ""
| #define PACKAGE_VERSION ""
| #define PACKAGE_STRING ""
| #define PACKAGE_BUGREPORT ""
| #define UNIX 1
| #define STDC_HEADERS 1
| #define HAVE_SYS_WAIT_H 1
| #define FEAT_NORMAL 1
| #define USE_XSMP_INTERACT 1
| #define FEAT_CSCOPE 1
| #define FEAT_NETBEANS_INTG 1
| #define FEAT_MBYTE 1
| #define HAVE_X11_SM_SMLIB_H 1
| #define HAVE_DATE_TIME 1
| #define HAVE_DIRENT_H 1
| #define HAVE_STDARG_H 1
| #define HAVE_STDLIB_H 1
| #define HAVE_STRING_H 1
| #define HAVE_SYS_SELECT_H 1
| #define HAVE_SYS_UTSNAME_H 1
| #define HAVE_TERMCAP_H 1
| #define HAVE_FCNTL_H 1
| #define HAVE_SGTTY_H 1
| #define HAVE_SYS_IOCTL_H 1
| #define HAVE_SYS_TIME_H 1
| #define HAVE_SYS_TYPES_H 1
| #define HAVE_ICONV_H 1
| #define HAVE_LANGINFO_H 1
| #define HAVE_MATH_H 1
| #define HAVE_UNISTD_H 1
| #define HAVE_ERRNO_H 1
| #define HAVE_SYS_RESOURCE_H 1
| #define HAVE_LOCALE_H 1
| #define HAVE_TERMIOS_H 1
| #define HAVE_LIBC_H 1
| #define HAVE_POLL_H 1
| #define HAVE_SYS_POLL_H 1
| #define HAVE_PWD_H 1
| #define HAVE_UTIME_H 1
| #define HAVE_SYS_PARAM_H 1
| #define HAVE_LIBGEN_H 1
| #define HAVE_COPYFILE_H 1
| #define HAVE_SYS_ACL_H 1
| #define HAVE_SYS_SYSCTL_H 1
| #define HAVE_WCHAR_H 1
| #define HAVE_WCTYPE_H 1
| #define HAVE_STRINGS_H 1
| #define TIME_WITH_SYS_TIME 1
| #define TERMINFO 1
| #define HAVE_OSPEED 1
| #define HAVE_UP_BC_PC 1
| #define SYS_SELECT_WITH_SYS_TIME 1
| #define HAVE_SVR4_PTYS 1
| #define PTYRANGE0 "pqrstuvw"
| #define PTYRANGE1 "0123456789abcdef"
| #define RETSIGTYPE void
| #define SIGRETURN return
| #define HAVE_SIGCONTEXT 1
| #define HAVE_BCMP 1
| #define HAVE_FCHDIR 1
| #define HAVE_FCHOWN 1
| #define HAVE_FSEEKO 1
| #define HAVE_FSYNC 1
| #define HAVE_FTELLO 1
| #define HAVE_GETCWD 1
| #define HAVE_GETPWNAM 1
| #define HAVE_GETPWUID 1
| #define HAVE_GETRLIMIT 1
| #define HAVE_GETTIMEOFDAY 1
| #define HAVE_GETWD 1
| #define HAVE_LSTAT 1
| #define HAVE_MEMCMP 1
| #define HAVE_MEMSET 1
| #define HAVE_NANOSLEEP 1
| #define HAVE_OPENDIR 1
| #define HAVE_PUTENV 1
| #define HAVE_QSORT 1
| #define HAVE_READLINK 1
| #define HAVE_SELECT 1
| #define HAVE_SETENV 1
| #define HAVE_SETPGID 1
| #define HAVE_SETSID 1
| #define HAVE_SIGALTSTACK 1
| #define HAVE_SIGSET 1
| #define HAVE_SIGSETJMP 1
| #define HAVE_SIGACTION 1
| #define HAVE_SIGVEC 1
| #define HAVE_STRCASECMP 1
| #define HAVE_STRERROR 1
| #define HAVE_STRFTIME 1
| #define HAVE_STRNCASECMP 1
| #define HAVE_STRPBRK 1
| #define HAVE_STRTOL 1
| #define HAVE_TGETENT 1
| #define HAVE_TOWLOWER 1
| #define HAVE_TOWUPPER 1
| #define HAVE_ISWUPPER 1
| #define HAVE_USLEEP 1
| #define HAVE_UTIME 1
| #define HAVE_UTIMES 1
| #define HAVE_COPYFILE 1
| #define HAVE_ST_BLKSIZE 1
| #define HAVE_ICONV 1
| #define HAVE_NL_LANGINFO_CODESET 1
| #define HAVE_LIBM 1
| #define HAVE_FLOAT_FUNCS 1
| #define HAVE_POSIX_ACL 1
| /* end confdefs.h.  */
| 
| #ifdef HAVE_SYS_ACL_H
| # include <sys/acl.h>
| #endif
| int
| main ()
| {
| acl("foo", GETACLCNT, 0, NULL);
| 
|   ;
|   return 0;
| }
configure:14622: result: no
configure:14630: checking for AIX ACL support
configure:14672: gcc -o conftest -arch i386 -arch x86_64 -g -Os -pipe -mdynamic-no-pic  -arch i386 -arch x86_64 -L/usr/local/lib conftest.c -lm  -lncurses -liconv >&5
In file included from /usr/include/sys/acl.h:26,
                 from conftest.c:117:
/usr/include/sys/kauth.h:120: error: expected specifier-qualifier-list before 'gid_t'
In file included from conftest.c:117:
/usr/include/sys/acl.h:163: error: expected '=', ',', ';', 'asm' or '__attribute__' before 'acl_copy_ext'
/usr/include/sys/acl.h:164: error: expected '=', ',', ';', 'asm' or '__attribute__' before 'acl_copy_ext_native'
/usr/include/sys/acl.h:168: error: expected '=', ',', ';', 'asm' or '__attribute__' before 'acl_size'
/usr/include/sys/acl.h:169: error: expected declaration specifiers or '...' before 'ssize_t'
conftest.c: In function 'main':
conftest.c:131: error: invalid application of 'sizeof' to incomplete type 'struct acl' 
conftest.c:133: error: 'STX_NORMAL' undeclared (first use in this function)
conftest.c:133: error: (Each undeclared identifier is reported only once
conftest.c:133: error: for each function it appears in.)
In file included from /usr/include/sys/acl.h:26,
                 from conftest.c:117:
/usr/include/sys/kauth.h:120: error: expected specifier-qualifier-list before 'gid_t'
In file included from conftest.c:117:
/usr/include/sys/acl.h:163: error: expected '=', ',', ';', 'asm' or '__attribute__' before 'acl_copy_ext'
/usr/include/sys/acl.h:164: error: expected '=', ',', ';', 'asm' or '__attribute__' before 'acl_copy_ext_native'
/usr/include/sys/acl.h:168: error: expected '=', ',', ';', 'asm' or '__attribute__' before 'acl_size'
/usr/include/sys/acl.h:169: error: expected declaration specifiers or '...' before 'ssize_t'
conftest.c: In function 'main':
conftest.c:131: error: invalid application of 'sizeof' to incomplete type 'struct acl' 
conftest.c:133: error: 'STX_NORMAL' undeclared (first use in this function)
conftest.c:133: error: (Each undeclared identifier is reported only once
conftest.c:133: error: for each function it appears in.)
lipo: can't figure out the architecture type of: /var/folders/IQ/IQuL0Q24Fna8hK1dP+jLgU+++TM/-Tmp-//ccdJ1zBZ.out
configure:14679: $? = 1
configure: failed program was:
| /* confdefs.h.  */
| #define PACKAGE_NAME ""
| #define PACKAGE_TARNAME ""
| #define PACKAGE_VERSION ""
| #define PACKAGE_STRING ""
| #define PACKAGE_BUGREPORT ""
| #define UNIX 1
| #define STDC_HEADERS 1
| #define HAVE_SYS_WAIT_H 1
| #define FEAT_NORMAL 1
| #define USE_XSMP_INTERACT 1
| #define FEAT_CSCOPE 1
| #define FEAT_NETBEANS_INTG 1
| #define FEAT_MBYTE 1
| #define HAVE_X11_SM_SMLIB_H 1
| #define HAVE_DATE_TIME 1
| #define HAVE_DIRENT_H 1
| #define HAVE_STDARG_H 1
| #define HAVE_STDLIB_H 1
| #define HAVE_STRING_H 1
| #define HAVE_SYS_SELECT_H 1
| #define HAVE_SYS_UTSNAME_H 1
| #define HAVE_TERMCAP_H 1
| #define HAVE_FCNTL_H 1
| #define HAVE_SGTTY_H 1
| #define HAVE_SYS_IOCTL_H 1
| #define HAVE_SYS_TIME_H 1
| #define HAVE_SYS_TYPES_H 1
| #define HAVE_ICONV_H 1
| #define HAVE_LANGINFO_H 1
| #define HAVE_MATH_H 1
| #define HAVE_UNISTD_H 1
| #define HAVE_ERRNO_H 1
| #define HAVE_SYS_RESOURCE_H 1
| #define HAVE_LOCALE_H 1
| #define HAVE_TERMIOS_H 1
| #define HAVE_LIBC_H 1
| #define HAVE_POLL_H 1
| #define HAVE_SYS_POLL_H 1
| #define HAVE_PWD_H 1
| #define HAVE_UTIME_H 1
| #define HAVE_SYS_PARAM_H 1
| #define HAVE_LIBGEN_H 1
| #define HAVE_COPYFILE_H 1
| #define HAVE_SYS_ACL_H 1
| #define HAVE_SYS_SYSCTL_H 1
| #define HAVE_WCHAR_H 1
| #define HAVE_WCTYPE_H 1
| #define HAVE_STRINGS_H 1
| #define TIME_WITH_SYS_TIME 1
| #define TERMINFO 1
| #define HAVE_OSPEED 1
| #define HAVE_UP_BC_PC 1
| #define SYS_SELECT_WITH_SYS_TIME 1
| #define HAVE_SVR4_PTYS 1
| #define PTYRANGE0 "pqrstuvw"
| #define PTYRANGE1 "0123456789abcdef"
| #define RETSIGTYPE void
| #define SIGRETURN return
| #define HAVE_SIGCONTEXT 1
| #define HAVE_BCMP 1
| #define HAVE_FCHDIR 1
| #define HAVE_FCHOWN 1
| #define HAVE_FSEEKO 1
| #define HAVE_FSYNC 1
| #define HAVE_FTELLO 1
| #define HAVE_GETCWD 1
| #define HAVE_GETPWNAM 1
| #define HAVE_GETPWUID 1
| #define HAVE_GETRLIMIT 1
| #define HAVE_GETTIMEOFDAY 1
| #define HAVE_GETWD 1
| #define HAVE_LSTAT 1
| #define HAVE_MEMCMP 1
| #define HAVE_MEMSET 1
| #define HAVE_NANOSLEEP 1
| #define HAVE_OPENDIR 1
| #define HAVE_PUTENV 1
| #define HAVE_QSORT 1
| #define HAVE_READLINK 1
| #define HAVE_SELECT 1
| #define HAVE_SETENV 1
| #define HAVE_SETPGID 1
| #define HAVE_SETSID 1
| #define HAVE_SIGALTSTACK 1
| #define HAVE_SIGSET 1
| #define HAVE_SIGSETJMP 1
| #define HAVE_SIGACTION 1
| #define HAVE_SIGVEC 1
| #define HAVE_STRCASECMP 1
| #define HAVE_STRERROR 1
| #define HAVE_STRFTIME 1
| #define HAVE_STRNCASECMP 1
| #define HAVE_STRPBRK 1
| #define HAVE_STRTOL 1
| #define HAVE_TGETENT 1
| #define HAVE_TOWLOWER 1
| #define HAVE_TOWUPPER 1
| #define HAVE_ISWUPPER 1
| #define HAVE_USLEEP 1
| #define HAVE_UTIME 1
| #define HAVE_UTIMES 1
| #define HAVE_COPYFILE 1
| #define HAVE_ST_BLKSIZE 1
| #define HAVE_ICONV 1
| #define HAVE_NL_LANGINFO_CODESET 1
| #define HAVE_LIBM 1
| #define HAVE_FLOAT_FUNCS 1
| #define HAVE_POSIX_ACL 1
| /* end confdefs.h.  */
| 
| #if STDC_HEADERS
| # include <stdlib.h>
| # include <stddef.h>
| #endif
| #ifdef HAVE_SYS_ACL_H
| # include <sys/acl.h>
| #endif
| #ifdef HAVE_SYS_ACCESS_H
| # include <sys/access.h>
| #endif
| #define _ALL_SOURCE
| 
| #include <sys/stat.h>
| 
| int aclsize;
| struct acl *aclent;
| int
| main ()
| {
| aclsize = sizeof(struct acl);
| 	aclent = (void *)malloc(aclsize);
| 	statacl("foo", STX_NORMAL, aclent, aclsize);
| 
|   ;
|   return 0;
| }
configure:14696: result: no
configure:14708: checking --disable-gpm argument
configure:14719: result: no
configure:14721: checking for gpm
configure:14749: gcc -o conftest -arch i386 -arch x86_64 -g -Os -pipe -mdynamic-no-pic  -arch i386 -arch x86_64 -L/usr/local/lib conftest.c -lgpm >&5
conftest.c:111:17: error: gpm.h: No such file or directory
conftest.c:112:33: error: linux/keyboard.h: No such file or directory
conftest.c: In function 'main':
conftest.c:116: error: 'NULL' undeclared (first use in this function)
conftest.c:116: error: (Each undeclared identifier is reported only once
conftest.c:116: error: for each function it appears in.)
conftest.c:111:17: error: gpm.h: No such file or directory
conftest.c:112:33: error: linux/keyboard.h: No such file or directory
conftest.c: In function 'main':
conftest.c:116: error: 'NULL' undeclared (first use in this function)
conftest.c:116: error: (Each undeclared identifier is reported only once
conftest.c:116: error: for each function it appears in.)
lipo: can't figure out the architecture type of: /var/folders/IQ/IQuL0Q24Fna8hK1dP+jLgU+++TM/-Tmp-//ccCOlKN7.out
configure:14756: $? = 1
configure: failed program was:
| /* confdefs.h.  */
| #define PACKAGE_NAME ""
| #define PACKAGE_TARNAME ""
| #define PACKAGE_VERSION ""
| #define PACKAGE_STRING ""
| #define PACKAGE_BUGREPORT ""
| #define UNIX 1
| #define STDC_HEADERS 1
| #define HAVE_SYS_WAIT_H 1
| #define FEAT_NORMAL 1
| #define USE_XSMP_INTERACT 1
| #define FEAT_CSCOPE 1
| #define FEAT_NETBEANS_INTG 1
| #define FEAT_MBYTE 1
| #define HAVE_X11_SM_SMLIB_H 1
| #define HAVE_DATE_TIME 1
| #define HAVE_DIRENT_H 1
| #define HAVE_STDARG_H 1
| #define HAVE_STDLIB_H 1
| #define HAVE_STRING_H 1
| #define HAVE_SYS_SELECT_H 1
| #define HAVE_SYS_UTSNAME_H 1
| #define HAVE_TERMCAP_H 1
| #define HAVE_FCNTL_H 1
| #define HAVE_SGTTY_H 1
| #define HAVE_SYS_IOCTL_H 1
| #define HAVE_SYS_TIME_H 1
| #define HAVE_SYS_TYPES_H 1
| #define HAVE_ICONV_H 1
| #define HAVE_LANGINFO_H 1
| #define HAVE_MATH_H 1
| #define HAVE_UNISTD_H 1
| #define HAVE_ERRNO_H 1
| #define HAVE_SYS_RESOURCE_H 1
| #define HAVE_LOCALE_H 1
| #define HAVE_TERMIOS_H 1
| #define HAVE_LIBC_H 1
| #define HAVE_POLL_H 1
| #define HAVE_SYS_POLL_H 1
| #define HAVE_PWD_H 1
| #define HAVE_UTIME_H 1
| #define HAVE_SYS_PARAM_H 1
| #define HAVE_LIBGEN_H 1
| #define HAVE_COPYFILE_H 1
| #define HAVE_SYS_ACL_H 1
| #define HAVE_SYS_SYSCTL_H 1
| #define HAVE_WCHAR_H 1
| #define HAVE_WCTYPE_H 1
| #define HAVE_STRINGS_H 1
| #define TIME_WITH_SYS_TIME 1
| #define TERMINFO 1
| #define HAVE_OSPEED 1
| #define HAVE_UP_BC_PC 1
| #define SYS_SELECT_WITH_SYS_TIME 1
| #define HAVE_SVR4_PTYS 1
| #define PTYRANGE0 "pqrstuvw"
| #define PTYRANGE1 "0123456789abcdef"
| #define RETSIGTYPE void
| #define SIGRETURN return
| #define HAVE_SIGCONTEXT 1
| #define HAVE_BCMP 1
| #define HAVE_FCHDIR 1
| #define HAVE_FCHOWN 1
| #define HAVE_FSEEKO 1
| #define HAVE_FSYNC 1
| #define HAVE_FTELLO 1
| #define HAVE_GETCWD 1
| #define HAVE_GETPWNAM 1
| #define HAVE_GETPWUID 1
| #define HAVE_GETRLIMIT 1
| #define HAVE_GETTIMEOFDAY 1
| #define HAVE_GETWD 1
| #define HAVE_LSTAT 1
| #define HAVE_MEMCMP 1
| #define HAVE_MEMSET 1
| #define HAVE_NANOSLEEP 1
| #define HAVE_OPENDIR 1
| #define HAVE_PUTENV 1
| #define HAVE_QSORT 1
| #define HAVE_READLINK 1
| #define HAVE_SELECT 1
| #define HAVE_SETENV 1
| #define HAVE_SETPGID 1
| #define HAVE_SETSID 1
| #define HAVE_SIGALTSTACK 1
| #define HAVE_SIGSET 1
| #define HAVE_SIGSETJMP 1
| #define HAVE_SIGACTION 1
| #define HAVE_SIGVEC 1
| #define HAVE_STRCASECMP 1
| #define HAVE_STRERROR 1
| #define HAVE_STRFTIME 1
| #define HAVE_STRNCASECMP 1
| #define HAVE_STRPBRK 1
| #define HAVE_STRTOL 1
| #define HAVE_TGETENT 1
| #define HAVE_TOWLOWER 1
| #define HAVE_TOWUPPER 1
| #define HAVE_ISWUPPER 1
| #define HAVE_USLEEP 1
| #define HAVE_UTIME 1
| #define HAVE_UTIMES 1
| #define HAVE_COPYFILE 1
| #define HAVE_ST_BLKSIZE 1
| #define HAVE_ICONV 1
| #define HAVE_NL_LANGINFO_CODESET 1
| #define HAVE_LIBM 1
| #define HAVE_FLOAT_FUNCS 1
| #define HAVE_POSIX_ACL 1
| /* end confdefs.h.  */
| #include <gpm.h>
| 	    #include <linux/keyboard.h>
| int
| main ()
| {
| Gpm_GetLibVersion(NULL);
|   ;
|   return 0;
| }
configure:14778: result: no
configure:14792: checking --disable-sysmouse argument
configure:14803: result: no
configure:14805: checking for sysmouse
configure:14837: gcc -o conftest -arch i386 -arch x86_64 -g -Os -pipe -mdynamic-no-pic  -arch i386 -arch x86_64 -L/usr/local/lib conftest.c -lm  -lncurses -liconv >&5
conftest.c:111:24: error: sys/consio.h: No such file or directory
conftest.c:113:28: error: sys/fbio.h: No such file or directory
conftest.c: In function 'main':
conftest.c:117: error: storage size of 'mouse' isn't known
conftest.c:118: error: 'MOUSE_MODE' undeclared (first use in this function)
conftest.c:118: error: (Each undeclared identifier is reported only once
conftest.c:118: error: for each function it appears in.)
conftest.c:119: error: 'MOUSE_SHOW' undeclared (first use in this function)
conftest.c:111:24: error: sys/consio.h: No such file or directory
conftest.c:113:28: error: sys/fbio.h: No such file or directory
conftest.c: In function 'main':
conftest.c:117: error: storage size of 'mouse' isn't known
conftest.c:118: error: 'MOUSE_MODE' undeclared (first use in this function)
conftest.c:118: error: (Each undeclared identifier is reported only once
conftest.c:118: error: for each function it appears in.)
conftest.c:119: error: 'MOUSE_SHOW' undeclared (first use in this function)
lipo: can't figure out the architecture type of: /var/folders/IQ/IQuL0Q24Fna8hK1dP+jLgU+++TM/-Tmp-//cc6hPM0v.out
configure:14844: $? = 1
configure: failed program was:
| /* confdefs.h.  */
| #define PACKAGE_NAME ""
| #define PACKAGE_TARNAME ""
| #define PACKAGE_VERSION ""
| #define PACKAGE_STRING ""
| #define PACKAGE_BUGREPORT ""
| #define UNIX 1
| #define STDC_HEADERS 1
| #define HAVE_SYS_WAIT_H 1
| #define FEAT_NORMAL 1
| #define USE_XSMP_INTERACT 1
| #define FEAT_CSCOPE 1
| #define FEAT_NETBEANS_INTG 1
| #define FEAT_MBYTE 1
| #define HAVE_X11_SM_SMLIB_H 1
| #define HAVE_DATE_TIME 1
| #define HAVE_DIRENT_H 1
| #define HAVE_STDARG_H 1
| #define HAVE_STDLIB_H 1
| #define HAVE_STRING_H 1
| #define HAVE_SYS_SELECT_H 1
| #define HAVE_SYS_UTSNAME_H 1
| #define HAVE_TERMCAP_H 1
| #define HAVE_FCNTL_H 1
| #define HAVE_SGTTY_H 1
| #define HAVE_SYS_IOCTL_H 1
| #define HAVE_SYS_TIME_H 1
| #define HAVE_SYS_TYPES_H 1
| #define HAVE_ICONV_H 1
| #define HAVE_LANGINFO_H 1
| #define HAVE_MATH_H 1
| #define HAVE_UNISTD_H 1
| #define HAVE_ERRNO_H 1
| #define HAVE_SYS_RESOURCE_H 1
| #define HAVE_LOCALE_H 1
| #define HAVE_TERMIOS_H 1
| #define HAVE_LIBC_H 1
| #define HAVE_POLL_H 1
| #define HAVE_SYS_POLL_H 1
| #define HAVE_PWD_H 1
| #define HAVE_UTIME_H 1
| #define HAVE_SYS_PARAM_H 1
| #define HAVE_LIBGEN_H 1
| #define HAVE_COPYFILE_H 1
| #define HAVE_SYS_ACL_H 1
| #define HAVE_SYS_SYSCTL_H 1
| #define HAVE_WCHAR_H 1
| #define HAVE_WCTYPE_H 1
| #define HAVE_STRINGS_H 1
| #define TIME_WITH_SYS_TIME 1
| #define TERMINFO 1
| #define HAVE_OSPEED 1
| #define HAVE_UP_BC_PC 1
| #define SYS_SELECT_WITH_SYS_TIME 1
| #define HAVE_SVR4_PTYS 1
| #define PTYRANGE0 "pqrstuvw"
| #define PTYRANGE1 "0123456789abcdef"
| #define RETSIGTYPE void
| #define SIGRETURN return
| #define HAVE_SIGCONTEXT 1
| #define HAVE_BCMP 1
| #define HAVE_FCHDIR 1
| #define HAVE_FCHOWN 1
| #define HAVE_FSEEKO 1
| #define HAVE_FSYNC 1
| #define HAVE_FTELLO 1
| #define HAVE_GETCWD 1
| #define HAVE_GETPWNAM 1
| #define HAVE_GETPWUID 1
| #define HAVE_GETRLIMIT 1
| #define HAVE_GETTIMEOFDAY 1
| #define HAVE_GETWD 1
| #define HAVE_LSTAT 1
| #define HAVE_MEMCMP 1
| #define HAVE_MEMSET 1
| #define HAVE_NANOSLEEP 1
| #define HAVE_OPENDIR 1
| #define HAVE_PUTENV 1
| #define HAVE_QSORT 1
| #define HAVE_READLINK 1
| #define HAVE_SELECT 1
| #define HAVE_SETENV 1
| #define HAVE_SETPGID 1
| #define HAVE_SETSID 1
| #define HAVE_SIGALTSTACK 1
| #define HAVE_SIGSET 1
| #define HAVE_SIGSETJMP 1
| #define HAVE_SIGACTION 1
| #define HAVE_SIGVEC 1
| #define HAVE_STRCASECMP 1
| #define HAVE_STRERROR 1
| #define HAVE_STRFTIME 1
| #define HAVE_STRNCASECMP 1
| #define HAVE_STRPBRK 1
| #define HAVE_STRTOL 1
| #define HAVE_TGETENT 1
| #define HAVE_TOWLOWER 1
| #define HAVE_TOWUPPER 1
| #define HAVE_ISWUPPER 1
| #define HAVE_USLEEP 1
| #define HAVE_UTIME 1
| #define HAVE_UTIMES 1
| #define HAVE_COPYFILE 1
| #define HAVE_ST_BLKSIZE 1
| #define HAVE_ICONV 1
| #define HAVE_NL_LANGINFO_CODESET 1
| #define HAVE_LIBM 1
| #define HAVE_FLOAT_FUNCS 1
| #define HAVE_POSIX_ACL 1
| /* end confdefs.h.  */
| #include <sys/consio.h>
| 	     #include <signal.h>
| 	     #include <sys/fbio.h>
| int
| main ()
| {
| struct mouse_info   mouse;
| 	     mouse.operation = MOUSE_MODE;
| 	     mouse.operation = MOUSE_SHOW;
| 	     mouse.u.mode.mode = 0;
| 	     mouse.u.mode.signal = SIGUSR2;
|   ;
|   return 0;
| }
configure:14865: result: no
configure:14878: checking for rename
configure:14901: gcc -o conftest -arch i386 -arch x86_64 -g -Os -pipe -mdynamic-no-pic  -arch i386 -arch x86_64 -L/usr/local/lib conftest.c -lm  -lncurses -liconv >&5
configure:14908: $? = 0
configure:14916: result: yes
configure:14933: checking for sysctl
configure:14964: gcc -c -arch i386 -arch x86_64 -g -Os -pipe -mdynamic-no-pic  conftest.c >&5
configure:14971: $? = 0
configure:14976: result: yes
configure:14991: checking for sysinfo
configure:15020: gcc -c -arch i386 -arch x86_64 -g -Os -pipe -mdynamic-no-pic  conftest.c >&5
conftest.c:114:25: error: sys/sysinfo.h: No such file or directory
conftest.c: In function 'main':
conftest.c:118: error: storage size of 'sinfo' isn't known
conftest.c:114:25: error: sys/sysinfo.h: No such file or directory
conftest.c: In function 'main':
conftest.c:118: error: storage size of 'sinfo' isn't known
lipo: can't open input file: /var/folders/IQ/IQuL0Q24Fna8hK1dP+jLgU+++TM/-Tmp-//ccRwVaA7.out (No such file or directory)
configure:15027: $? = 1
configure: failed program was:
| /* confdefs.h.  */
| #define PACKAGE_NAME ""
| #define PACKAGE_TARNAME ""
| #define PACKAGE_VERSION ""
| #define PACKAGE_STRING ""
| #define PACKAGE_BUGREPORT ""
| #define UNIX 1
| #define STDC_HEADERS 1
| #define HAVE_SYS_WAIT_H 1
| #define FEAT_NORMAL 1
| #define USE_XSMP_INTERACT 1
| #define FEAT_CSCOPE 1
| #define FEAT_NETBEANS_INTG 1
| #define FEAT_MBYTE 1
| #define HAVE_X11_SM_SMLIB_H 1
| #define HAVE_DATE_TIME 1
| #define HAVE_DIRENT_H 1
| #define HAVE_STDARG_H 1
| #define HAVE_STDLIB_H 1
| #define HAVE_STRING_H 1
| #define HAVE_SYS_SELECT_H 1
| #define HAVE_SYS_UTSNAME_H 1
| #define HAVE_TERMCAP_H 1
| #define HAVE_FCNTL_H 1
| #define HAVE_SGTTY_H 1
| #define HAVE_SYS_IOCTL_H 1
| #define HAVE_SYS_TIME_H 1
| #define HAVE_SYS_TYPES_H 1
| #define HAVE_ICONV_H 1
| #define HAVE_LANGINFO_H 1
| #define HAVE_MATH_H 1
| #define HAVE_UNISTD_H 1
| #define HAVE_ERRNO_H 1
| #define HAVE_SYS_RESOURCE_H 1
| #define HAVE_LOCALE_H 1
| #define HAVE_TERMIOS_H 1
| #define HAVE_LIBC_H 1
| #define HAVE_POLL_H 1
| #define HAVE_SYS_POLL_H 1
| #define HAVE_PWD_H 1
| #define HAVE_UTIME_H 1
| #define HAVE_SYS_PARAM_H 1
| #define HAVE_LIBGEN_H 1
| #define HAVE_COPYFILE_H 1
| #define HAVE_SYS_ACL_H 1
| #define HAVE_SYS_SYSCTL_H 1
| #define HAVE_WCHAR_H 1
| #define HAVE_WCTYPE_H 1
| #define HAVE_STRINGS_H 1
| #define TIME_WITH_SYS_TIME 1
| #define TERMINFO 1
| #define HAVE_OSPEED 1
| #define HAVE_UP_BC_PC 1
| #define SYS_SELECT_WITH_SYS_TIME 1
| #define HAVE_SVR4_PTYS 1
| #define PTYRANGE0 "pqrstuvw"
| #define PTYRANGE1 "0123456789abcdef"
| #define RETSIGTYPE void
| #define SIGRETURN return
| #define HAVE_SIGCONTEXT 1
| #define HAVE_BCMP 1
| #define HAVE_FCHDIR 1
| #define HAVE_FCHOWN 1
| #define HAVE_FSEEKO 1
| #define HAVE_FSYNC 1
| #define HAVE_FTELLO 1
| #define HAVE_GETCWD 1
| #define HAVE_GETPWNAM 1
| #define HAVE_GETPWUID 1
| #define HAVE_GETRLIMIT 1
| #define HAVE_GETTIMEOFDAY 1
| #define HAVE_GETWD 1
| #define HAVE_LSTAT 1
| #define HAVE_MEMCMP 1
| #define HAVE_MEMSET 1
| #define HAVE_NANOSLEEP 1
| #define HAVE_OPENDIR 1
| #define HAVE_PUTENV 1
| #define HAVE_QSORT 1
| #define HAVE_READLINK 1
| #define HAVE_SELECT 1
| #define HAVE_SETENV 1
| #define HAVE_SETPGID 1
| #define HAVE_SETSID 1
| #define HAVE_SIGALTSTACK 1
| #define HAVE_SIGSET 1
| #define HAVE_SIGSETJMP 1
| #define HAVE_SIGACTION 1
| #define HAVE_SIGVEC 1
| #define HAVE_STRCASECMP 1
| #define HAVE_STRERROR 1
| #define HAVE_STRFTIME 1
| #define HAVE_STRNCASECMP 1
| #define HAVE_STRPBRK 1
| #define HAVE_STRTOL 1
| #define HAVE_TGETENT 1
| #define HAVE_TOWLOWER 1
| #define HAVE_TOWUPPER 1
| #define HAVE_ISWUPPER 1
| #define HAVE_USLEEP 1
| #define HAVE_UTIME 1
| #define HAVE_UTIMES 1
| #define HAVE_COPYFILE 1
| #define HAVE_ST_BLKSIZE 1
| #define HAVE_ICONV 1
| #define HAVE_NL_LANGINFO_CODESET 1
| #define HAVE_LIBM 1
| #define HAVE_FLOAT_FUNCS 1
| #define HAVE_POSIX_ACL 1
| #define HAVE_RENAME 1
| #define HAVE_SYSCTL 1
| /* end confdefs.h.  */
| #include <sys/types.h>
| #include <sys/sysinfo.h>
| int
| main ()
| {
| 	struct sysinfo sinfo;
| 	int t;
| 
| 	(void)sysinfo(&sinfo);
| 	t = sinfo.totalram;
| 
|   ;
|   return 0;
| }
configure:15041: result: not usable
configure:15047: checking for sysinfo.mem_unit
configure:15073: gcc -c -arch i386 -arch x86_64 -g -Os -pipe -mdynamic-no-pic  conftest.c >&5
conftest.c:114:25: error: sys/sysinfo.h: No such file or directory
conftest.c: In function 'main':
conftest.c:118: error: storage size of 'sinfo' isn't known
conftest.c:114:25: error: sys/sysinfo.h: No such file or directory
conftest.c: In function 'main':
conftest.c:118: error: storage size of 'sinfo' isn't known
lipo: can't open input file: /var/folders/IQ/IQuL0Q24Fna8hK1dP+jLgU+++TM/-Tmp-//ccimG9pB.out (No such file or directory)
configure:15080: $? = 1
configure: failed program was:
| /* confdefs.h.  */
| #define PACKAGE_NAME ""
| #define PACKAGE_TARNAME ""
| #define PACKAGE_VERSION ""
| #define PACKAGE_STRING ""
| #define PACKAGE_BUGREPORT ""
| #define UNIX 1
| #define STDC_HEADERS 1
| #define HAVE_SYS_WAIT_H 1
| #define FEAT_NORMAL 1
| #define USE_XSMP_INTERACT 1
| #define FEAT_CSCOPE 1
| #define FEAT_NETBEANS_INTG 1
| #define FEAT_MBYTE 1
| #define HAVE_X11_SM_SMLIB_H 1
| #define HAVE_DATE_TIME 1
| #define HAVE_DIRENT_H 1
| #define HAVE_STDARG_H 1
| #define HAVE_STDLIB_H 1
| #define HAVE_STRING_H 1
| #define HAVE_SYS_SELECT_H 1
| #define HAVE_SYS_UTSNAME_H 1
| #define HAVE_TERMCAP_H 1
| #define HAVE_FCNTL_H 1
| #define HAVE_SGTTY_H 1
| #define HAVE_SYS_IOCTL_H 1
| #define HAVE_SYS_TIME_H 1
| #define HAVE_SYS_TYPES_H 1
| #define HAVE_ICONV_H 1
| #define HAVE_LANGINFO_H 1
| #define HAVE_MATH_H 1
| #define HAVE_UNISTD_H 1
| #define HAVE_ERRNO_H 1
| #define HAVE_SYS_RESOURCE_H 1
| #define HAVE_LOCALE_H 1
| #define HAVE_TERMIOS_H 1
| #define HAVE_LIBC_H 1
| #define HAVE_POLL_H 1
| #define HAVE_SYS_POLL_H 1
| #define HAVE_PWD_H 1
| #define HAVE_UTIME_H 1
| #define HAVE_SYS_PARAM_H 1
| #define HAVE_LIBGEN_H 1
| #define HAVE_COPYFILE_H 1
| #define HAVE_SYS_ACL_H 1
| #define HAVE_SYS_SYSCTL_H 1
| #define HAVE_WCHAR_H 1
| #define HAVE_WCTYPE_H 1
| #define HAVE_STRINGS_H 1
| #define TIME_WITH_SYS_TIME 1
| #define TERMINFO 1
| #define HAVE_OSPEED 1
| #define HAVE_UP_BC_PC 1
| #define SYS_SELECT_WITH_SYS_TIME 1
| #define HAVE_SVR4_PTYS 1
| #define PTYRANGE0 "pqrstuvw"
| #define PTYRANGE1 "0123456789abcdef"
| #define RETSIGTYPE void
| #define SIGRETURN return
| #define HAVE_SIGCONTEXT 1
| #define HAVE_BCMP 1
| #define HAVE_FCHDIR 1
| #define HAVE_FCHOWN 1
| #define HAVE_FSEEKO 1
| #define HAVE_FSYNC 1
| #define HAVE_FTELLO 1
| #define HAVE_GETCWD 1
| #define HAVE_GETPWNAM 1
| #define HAVE_GETPWUID 1
| #define HAVE_GETRLIMIT 1
| #define HAVE_GETTIMEOFDAY 1
| #define HAVE_GETWD 1
| #define HAVE_LSTAT 1
| #define HAVE_MEMCMP 1
| #define HAVE_MEMSET 1
| #define HAVE_NANOSLEEP 1
| #define HAVE_OPENDIR 1
| #define HAVE_PUTENV 1
| #define HAVE_QSORT 1
| #define HAVE_READLINK 1
| #define HAVE_SELECT 1
| #define HAVE_SETENV 1
| #define HAVE_SETPGID 1
| #define HAVE_SETSID 1
| #define HAVE_SIGALTSTACK 1
| #define HAVE_SIGSET 1
| #define HAVE_SIGSETJMP 1
| #define HAVE_SIGACTION 1
| #define HAVE_SIGVEC 1
| #define HAVE_STRCASECMP 1
| #define HAVE_STRERROR 1
| #define HAVE_STRFTIME 1
| #define HAVE_STRNCASECMP 1
| #define HAVE_STRPBRK 1
| #define HAVE_STRTOL 1
| #define HAVE_TGETENT 1
| #define HAVE_TOWLOWER 1
| #define HAVE_TOWUPPER 1
| #define HAVE_ISWUPPER 1
| #define HAVE_USLEEP 1
| #define HAVE_UTIME 1
| #define HAVE_UTIMES 1
| #define HAVE_COPYFILE 1
| #define HAVE_ST_BLKSIZE 1
| #define HAVE_ICONV 1
| #define HAVE_NL_LANGINFO_CODESET 1
| #define HAVE_LIBM 1
| #define HAVE_FLOAT_FUNCS 1
| #define HAVE_POSIX_ACL 1
| #define HAVE_RENAME 1
| #define HAVE_SYSCTL 1
| /* end confdefs.h.  */
| #include <sys/types.h>
| #include <sys/sysinfo.h>
| int
| main ()
| {
| 	struct sysinfo sinfo;
|  	sinfo.mem_unit = 1;
| 
|   ;
|   return 0;
| }
configure:15094: result: no
configure:15100: checking for sysconf
configure:15125: gcc -c -arch i386 -arch x86_64 -g -Os -pipe -mdynamic-no-pic  conftest.c >&5
conftest.c: In function 'main':
conftest.c:118: error: '_SC_PHYS_PAGES' undeclared (first use in this function)
conftest.c:118: error: (Each undeclared identifier is reported only once
conftest.c:118: error: for each function it appears in.)
conftest.c: In function 'main':
conftest.c:118: error: '_SC_PHYS_PAGES' undeclared (first use in this function)
conftest.c:118: error: (Each undeclared identifier is reported only once
conftest.c:118: error: for each function it appears in.)
lipo: can't open input file: /var/folders/IQ/IQuL0Q24Fna8hK1dP+jLgU+++TM/-Tmp-//ccYIvuht.out (No such file or directory)
configure:15132: $? = 1
configure: failed program was:
| /* confdefs.h.  */
| #define PACKAGE_NAME ""
| #define PACKAGE_TARNAME ""
| #define PACKAGE_VERSION ""
| #define PACKAGE_STRING ""
| #define PACKAGE_BUGREPORT ""
| #define UNIX 1
| #define STDC_HEADERS 1
| #define HAVE_SYS_WAIT_H 1
| #define FEAT_NORMAL 1
| #define USE_XSMP_INTERACT 1
| #define FEAT_CSCOPE 1
| #define FEAT_NETBEANS_INTG 1
| #define FEAT_MBYTE 1
| #define HAVE_X11_SM_SMLIB_H 1
| #define HAVE_DATE_TIME 1
| #define HAVE_DIRENT_H 1
| #define HAVE_STDARG_H 1
| #define HAVE_STDLIB_H 1
| #define HAVE_STRING_H 1
| #define HAVE_SYS_SELECT_H 1
| #define HAVE_SYS_UTSNAME_H 1
| #define HAVE_TERMCAP_H 1
| #define HAVE_FCNTL_H 1
| #define HAVE_SGTTY_H 1
| #define HAVE_SYS_IOCTL_H 1
| #define HAVE_SYS_TIME_H 1
| #define HAVE_SYS_TYPES_H 1
| #define HAVE_ICONV_H 1
| #define HAVE_LANGINFO_H 1
| #define HAVE_MATH_H 1
| #define HAVE_UNISTD_H 1
| #define HAVE_ERRNO_H 1
| #define HAVE_SYS_RESOURCE_H 1
| #define HAVE_LOCALE_H 1
| #define HAVE_TERMIOS_H 1
| #define HAVE_LIBC_H 1
| #define HAVE_POLL_H 1
| #define HAVE_SYS_POLL_H 1
| #define HAVE_PWD_H 1
| #define HAVE_UTIME_H 1
| #define HAVE_SYS_PARAM_H 1
| #define HAVE_LIBGEN_H 1
| #define HAVE_COPYFILE_H 1
| #define HAVE_SYS_ACL_H 1
| #define HAVE_SYS_SYSCTL_H 1
| #define HAVE_WCHAR_H 1
| #define HAVE_WCTYPE_H 1
| #define HAVE_STRINGS_H 1
| #define TIME_WITH_SYS_TIME 1
| #define TERMINFO 1
| #define HAVE_OSPEED 1
| #define HAVE_UP_BC_PC 1
| #define SYS_SELECT_WITH_SYS_TIME 1
| #define HAVE_SVR4_PTYS 1
| #define PTYRANGE0 "pqrstuvw"
| #define PTYRANGE1 "0123456789abcdef"
| #define RETSIGTYPE void
| #define SIGRETURN return
| #define HAVE_SIGCONTEXT 1
| #define HAVE_BCMP 1
| #define HAVE_FCHDIR 1
| #define HAVE_FCHOWN 1
| #define HAVE_FSEEKO 1
| #define HAVE_FSYNC 1
| #define HAVE_FTELLO 1
| #define HAVE_GETCWD 1
| #define HAVE_GETPWNAM 1
| #define HAVE_GETPWUID 1
| #define HAVE_GETRLIMIT 1
| #define HAVE_GETTIMEOFDAY 1
| #define HAVE_GETWD 1
| #define HAVE_LSTAT 1
| #define HAVE_MEMCMP 1
| #define HAVE_MEMSET 1
| #define HAVE_NANOSLEEP 1
| #define HAVE_OPENDIR 1
| #define HAVE_PUTENV 1
| #define HAVE_QSORT 1
| #define HAVE_READLINK 1
| #define HAVE_SELECT 1
| #define HAVE_SETENV 1
| #define HAVE_SETPGID 1
| #define HAVE_SETSID 1
| #define HAVE_SIGALTSTACK 1
| #define HAVE_SIGSET 1
| #define HAVE_SIGSETJMP 1
| #define HAVE_SIGACTION 1
| #define HAVE_SIGVEC 1
| #define HAVE_STRCASECMP 1
| #define HAVE_STRERROR 1
| #define HAVE_STRFTIME 1
| #define HAVE_STRNCASECMP 1
| #define HAVE_STRPBRK 1
| #define HAVE_STRTOL 1
| #define HAVE_TGETENT 1
| #define HAVE_TOWLOWER 1
| #define HAVE_TOWUPPER 1
| #define HAVE_ISWUPPER 1
| #define HAVE_USLEEP 1
| #define HAVE_UTIME 1
| #define HAVE_UTIMES 1
| #define HAVE_COPYFILE 1
| #define HAVE_ST_BLKSIZE 1
| #define HAVE_ICONV 1
| #define HAVE_NL_LANGINFO_CODESET 1
| #define HAVE_LIBM 1
| #define HAVE_FLOAT_FUNCS 1
| #define HAVE_POSIX_ACL 1
| #define HAVE_RENAME 1
| #define HAVE_SYSCTL 1
| /* end confdefs.h.  */
| #include <unistd.h>
| int
| main ()
| {
| 	(void)sysconf(_SC_PAGESIZE);
| 	(void)sysconf(_SC_PHYS_PAGES);
| 
|   ;
|   return 0;
| }
configure:15146: result: not usable
configure:15153: checking size of int
configure:15189: gcc -o conftest -arch i386 -arch x86_64 -g -Os -pipe -mdynamic-no-pic  -arch i386 -arch x86_64 -L/usr/local/lib conftest.c -lm  -lncurses -liconv >&5
configure:15193: $? = 0
configure:15199: ./conftest
configure:15203: $? = 0
configure:15221: result: 4
configure:15252: checking whether memmove handles overlaps
configure:15274: gcc -o conftest -arch i386 -arch x86_64 -g -Os -pipe -mdynamic-no-pic  -arch i386 -arch x86_64 -L/usr/local/lib conftest.c -lm  -lncurses -liconv >&5
configure:15278: $? = 0
configure:15284: ./conftest
configure:15288: $? = 0
configure:15310: result: yes
configure:15464: checking whether X_LOCALE needed
configure:15487: gcc -c -arch i386 -arch x86_64 -g -Os -pipe -mdynamic-no-pic -INONE  conftest.c >&5
configure:15494: $? = 0
configure:15527: gcc -o conftest -arch i386 -arch x86_64 -g -Os -pipe -mdynamic-no-pic -INONE   -arch i386 -arch x86_64 -L/usr/local/lib -lX11 conftest.c -lm  -lncurses -liconv >&5
ld: library not found for -lX11
collect2: ld returned 1 exit status
ld: library not found for -lX11
collect2: ld returned 1 exit status
lipo: can't open input file: /var/folders/IQ/IQuL0Q24Fna8hK1dP+jLgU+++TM/-Tmp-//ccfoDy4s.out (No such file or directory)
configure:15534: $? = 1
configure: failed program was:
| /* confdefs.h.  */
| #define PACKAGE_NAME ""
| #define PACKAGE_TARNAME ""
| #define PACKAGE_VERSION ""
| #define PACKAGE_STRING ""
| #define PACKAGE_BUGREPORT ""
| #define UNIX 1
| #define STDC_HEADERS 1
| #define HAVE_SYS_WAIT_H 1
| #define FEAT_NORMAL 1
| #define USE_XSMP_INTERACT 1
| #define FEAT_CSCOPE 1
| #define FEAT_NETBEANS_INTG 1
| #define FEAT_MBYTE 1
| #define HAVE_X11_SM_SMLIB_H 1
| #define HAVE_DATE_TIME 1
| #define HAVE_DIRENT_H 1
| #define HAVE_STDARG_H 1
| #define HAVE_STDLIB_H 1
| #define HAVE_STRING_H 1
| #define HAVE_SYS_SELECT_H 1
| #define HAVE_SYS_UTSNAME_H 1
| #define HAVE_TERMCAP_H 1
| #define HAVE_FCNTL_H 1
| #define HAVE_SGTTY_H 1
| #define HAVE_SYS_IOCTL_H 1
| #define HAVE_SYS_TIME_H 1
| #define HAVE_SYS_TYPES_H 1
| #define HAVE_ICONV_H 1
| #define HAVE_LANGINFO_H 1
| #define HAVE_MATH_H 1
| #define HAVE_UNISTD_H 1
| #define HAVE_ERRNO_H 1
| #define HAVE_SYS_RESOURCE_H 1
| #define HAVE_LOCALE_H 1
| #define HAVE_TERMIOS_H 1
| #define HAVE_LIBC_H 1
| #define HAVE_POLL_H 1
| #define HAVE_SYS_POLL_H 1
| #define HAVE_PWD_H 1
| #define HAVE_UTIME_H 1
| #define HAVE_SYS_PARAM_H 1
| #define HAVE_LIBGEN_H 1
| #define HAVE_COPYFILE_H 1
| #define HAVE_SYS_ACL_H 1
| #define HAVE_SYS_SYSCTL_H 1
| #define HAVE_WCHAR_H 1
| #define HAVE_WCTYPE_H 1
| #define HAVE_STRINGS_H 1
| #define TIME_WITH_SYS_TIME 1
| #define TERMINFO 1
| #define HAVE_OSPEED 1
| #define HAVE_UP_BC_PC 1
| #define SYS_SELECT_WITH_SYS_TIME 1
| #define HAVE_SVR4_PTYS 1
| #define PTYRANGE0 "pqrstuvw"
| #define PTYRANGE1 "0123456789abcdef"
| #define RETSIGTYPE void
| #define SIGRETURN return
| #define HAVE_SIGCONTEXT 1
| #define HAVE_BCMP 1
| #define HAVE_FCHDIR 1
| #define HAVE_FCHOWN 1
| #define HAVE_FSEEKO 1
| #define HAVE_FSYNC 1
| #define HAVE_FTELLO 1
| #define HAVE_GETCWD 1
| #define HAVE_GETPWNAM 1
| #define HAVE_GETPWUID 1
| #define HAVE_GETRLIMIT 1
| #define HAVE_GETTIMEOFDAY 1
| #define HAVE_GETWD 1
| #define HAVE_LSTAT 1
| #define HAVE_MEMCMP 1
| #define HAVE_MEMSET 1
| #define HAVE_NANOSLEEP 1
| #define HAVE_OPENDIR 1
| #define HAVE_PUTENV 1
| #define HAVE_QSORT 1
| #define HAVE_READLINK 1
| #define HAVE_SELECT 1
| #define HAVE_SETENV 1
| #define HAVE_SETPGID 1
| #define HAVE_SETSID 1
| #define HAVE_SIGALTSTACK 1
| #define HAVE_SIGSET 1
| #define HAVE_SIGSETJMP 1
| #define HAVE_SIGACTION 1
| #define HAVE_SIGVEC 1
| #define HAVE_STRCASECMP 1
| #define HAVE_STRERROR 1
| #define HAVE_STRFTIME 1
| #define HAVE_STRNCASECMP 1
| #define HAVE_STRPBRK 1
| #define HAVE_STRTOL 1
| #define HAVE_TGETENT 1
| #define HAVE_TOWLOWER 1
| #define HAVE_TOWUPPER 1
| #define HAVE_ISWUPPER 1
| #define HAVE_USLEEP 1
| #define HAVE_UTIME 1
| #define HAVE_UTIMES 1
| #define HAVE_COPYFILE 1
| #define HAVE_ST_BLKSIZE 1
| #define HAVE_ICONV 1
| #define HAVE_NL_LANGINFO_CODESET 1
| #define HAVE_LIBM 1
| #define HAVE_FLOAT_FUNCS 1
| #define HAVE_POSIX_ACL 1
| #define HAVE_RENAME 1
| #define HAVE_SYSCTL 1
| #define SIZEOF_INT 4
| #define USEMEMMOVE 1
| /* end confdefs.h.  */
| 
| /* Override any GCC internal prototype to avoid an error.
|    Use char because int might match the return type of a GCC
|    builtin and then its argument prototype would still apply.  */
| #ifdef __cplusplus
| extern "C"
| #endif
| char _Xsetlocale ();
| int
| main ()
| {
| return _Xsetlocale ();
|   ;
|   return 0;
| }
configure:15552: result: no
configure:15573: checking for _xpg4_setrunelocale in -lxpg4
configure:15608: gcc -o conftest -arch i386 -arch x86_64 -g -Os -pipe -mdynamic-no-pic  -arch i386 -arch x86_64 -L/usr/local/lib conftest.c -lxpg4  -lm  -lncurses -liconv >&5
ld: library not found for -lxpg4
collect2: ld returned 1 exit status
ld: library not found for -lxpg4
collect2: ld returned 1 exit status
lipo: can't open input file: /var/folders/IQ/IQuL0Q24Fna8hK1dP+jLgU+++TM/-Tmp-//ccMb8fig.out (No such file or directory)
configure:15615: $? = 1
configure: failed program was:
| /* confdefs.h.  */
| #define PACKAGE_NAME ""
| #define PACKAGE_TARNAME ""
| #define PACKAGE_VERSION ""
| #define PACKAGE_STRING ""
| #define PACKAGE_BUGREPORT ""
| #define UNIX 1
| #define STDC_HEADERS 1
| #define HAVE_SYS_WAIT_H 1
| #define FEAT_NORMAL 1
| #define USE_XSMP_INTERACT 1
| #define FEAT_CSCOPE 1
| #define FEAT_NETBEANS_INTG 1
| #define FEAT_MBYTE 1
| #define HAVE_X11_SM_SMLIB_H 1
| #define HAVE_DATE_TIME 1
| #define HAVE_DIRENT_H 1
| #define HAVE_STDARG_H 1
| #define HAVE_STDLIB_H 1
| #define HAVE_STRING_H 1
| #define HAVE_SYS_SELECT_H 1
| #define HAVE_SYS_UTSNAME_H 1
| #define HAVE_TERMCAP_H 1
| #define HAVE_FCNTL_H 1
| #define HAVE_SGTTY_H 1
| #define HAVE_SYS_IOCTL_H 1
| #define HAVE_SYS_TIME_H 1
| #define HAVE_SYS_TYPES_H 1
| #define HAVE_ICONV_H 1
| #define HAVE_LANGINFO_H 1
| #define HAVE_MATH_H 1
| #define HAVE_UNISTD_H 1
| #define HAVE_ERRNO_H 1
| #define HAVE_SYS_RESOURCE_H 1
| #define HAVE_LOCALE_H 1
| #define HAVE_TERMIOS_H 1
| #define HAVE_LIBC_H 1
| #define HAVE_POLL_H 1
| #define HAVE_SYS_POLL_H 1
| #define HAVE_PWD_H 1
| #define HAVE_UTIME_H 1
| #define HAVE_SYS_PARAM_H 1
| #define HAVE_LIBGEN_H 1
| #define HAVE_COPYFILE_H 1
| #define HAVE_SYS_ACL_H 1
| #define HAVE_SYS_SYSCTL_H 1
| #define HAVE_WCHAR_H 1
| #define HAVE_WCTYPE_H 1
| #define HAVE_STRINGS_H 1
| #define TIME_WITH_SYS_TIME 1
| #define TERMINFO 1
| #define HAVE_OSPEED 1
| #define HAVE_UP_BC_PC 1
| #define SYS_SELECT_WITH_SYS_TIME 1
| #define HAVE_SVR4_PTYS 1
| #define PTYRANGE0 "pqrstuvw"
| #define PTYRANGE1 "0123456789abcdef"
| #define RETSIGTYPE void
| #define SIGRETURN return
| #define HAVE_SIGCONTEXT 1
| #define HAVE_BCMP 1
| #define HAVE_FCHDIR 1
| #define HAVE_FCHOWN 1
| #define HAVE_FSEEKO 1
| #define HAVE_FSYNC 1
| #define HAVE_FTELLO 1
| #define HAVE_GETCWD 1
| #define HAVE_GETPWNAM 1
| #define HAVE_GETPWUID 1
| #define HAVE_GETRLIMIT 1
| #define HAVE_GETTIMEOFDAY 1
| #define HAVE_GETWD 1
| #define HAVE_LSTAT 1
| #define HAVE_MEMCMP 1
| #define HAVE_MEMSET 1
| #define HAVE_NANOSLEEP 1
| #define HAVE_OPENDIR 1
| #define HAVE_PUTENV 1
| #define HAVE_QSORT 1
| #define HAVE_READLINK 1
| #define HAVE_SELECT 1
| #define HAVE_SETENV 1
| #define HAVE_SETPGID 1
| #define HAVE_SETSID 1
| #define HAVE_SIGALTSTACK 1
| #define HAVE_SIGSET 1
| #define HAVE_SIGSETJMP 1
| #define HAVE_SIGACTION 1
| #define HAVE_SIGVEC 1
| #define HAVE_STRCASECMP 1
| #define HAVE_STRERROR 1
| #define HAVE_STRFTIME 1
| #define HAVE_STRNCASECMP 1
| #define HAVE_STRPBRK 1
| #define HAVE_STRTOL 1
| #define HAVE_TGETENT 1
| #define HAVE_TOWLOWER 1
| #define HAVE_TOWUPPER 1
| #define HAVE_ISWUPPER 1
| #define HAVE_USLEEP 1
| #define HAVE_UTIME 1
| #define HAVE_UTIMES 1
| #define HAVE_COPYFILE 1
| #define HAVE_ST_BLKSIZE 1
| #define HAVE_ICONV 1
| #define HAVE_NL_LANGINFO_CODESET 1
| #define HAVE_LIBM 1
| #define HAVE_FLOAT_FUNCS 1
| #define HAVE_POSIX_ACL 1
| #define HAVE_RENAME 1
| #define HAVE_SYSCTL 1
| #define SIZEOF_INT 4
| #define USEMEMMOVE 1
| /* end confdefs.h.  */
| 
| /* Override any GCC internal prototype to avoid an error.
|    Use char because int might match the return type of a GCC
|    builtin and then its argument prototype would still apply.  */
| #ifdef __cplusplus
| extern "C"
| #endif
| char _xpg4_setrunelocale ();
| int
| main ()
| {
| return _xpg4_setrunelocale ();
|   ;
|   return 0;
| }
configure:15636: result: no
configure:15643: checking how to create tags
ctags: illegal option -- -
usage: ctags [-BFadtuwvx] [-f tagsfile] file ...
etags: skipping /dev/null: it is not a regular file.
etags: no input files specified.
	Try `etags --help' for a complete list of options.
ctags: illegal option -- s
usage: ctags [-BFadtuwvx] [-f tagsfile] file ...
ctags: illegal option -- s
usage: ctags [-BFadtuwvx] [-f tagsfile] file ...
ctags: illegal option -- i
usage: ctags [-BFadtuwvx] [-f tagsfile] file ...
configure:15658: result: ctags -t
configure:15661: checking how to run man with a section nr
configure:15665: result: man -s
configure:15674: checking --disable-nls argument
configure:15685: result: no
configure:15695: checking for msgfmt
configure:15725: result: no
configure:15730: checking for NLS
configure:16002: result: no "po/Makefile" - disabled
configure:16020: checking dlfcn.h usability
configure:16037: gcc -c -arch i386 -arch x86_64 -g -Os -pipe -mdynamic-no-pic  conftest.c >&5
configure:16044: $? = 0
configure:16058: result: yes
configure:16062: checking dlfcn.h presence
configure:16077: gcc -E  conftest.c
configure:16084: $? = 0
configure:16098: result: yes
configure:16126: checking for dlfcn.h
configure:16133: result: yes
configure:16281: checking for dlopen()
configure:16307: gcc -o conftest -arch i386 -arch x86_64 -g -Os -pipe -mdynamic-no-pic  -arch i386 -arch x86_64 -L/usr/local/lib conftest.c -lm  -lncurses -liconv >&5
configure:16314: $? = 0
configure:16322: result: yes
configure:16402: checking for dlsym()
configure:16428: gcc -o conftest -arch i386 -arch x86_64 -g -Os -pipe -mdynamic-no-pic  -arch i386 -arch x86_64 -L/usr/local/lib conftest.c -lm  -lncurses -liconv >&5
configure:16435: $? = 0
configure:16443: result: yes
configure:16667: checking setjmp.h usability
configure:16684: gcc -c -arch i386 -arch x86_64 -g -Os -pipe -mdynamic-no-pic  conftest.c >&5
configure:16691: $? = 0
configure:16705: result: yes
configure:16709: checking setjmp.h presence
configure:16724: gcc -E  conftest.c
configure:16731: $? = 0
configure:16745: result: yes
configure:16773: checking for setjmp.h
configure:16782: result: yes
configure:16824: checking for GCC 3 or later
configure:16829: result: yes
configure:16835: checking whether we need -D_FORTIFY_SOURCE=1
configure:16839: result: yes
configure:16915: updating cache auto/config.cache
configure:16952: creating auto/config.status

## ---------------------- ##
## Running config.status. ##
## ---------------------- ##

This file was extended by config.status, which was
generated by GNU Autoconf 2.62.  Invocation command line was

  CONFIG_FILES    = 
  CONFIG_HEADERS  = 
  CONFIG_LINKS    = 
  CONFIG_COMMANDS = 
  $ auto/config.status 

on il0204d-dhcp14.apple.com

config.status:906: creating auto/config.mk
config.status:906: creating auto/config.h
configure:18074: WARNING: Unrecognized options: --disable-dependency-tracking

## ---------------- ##
## Cache variables. ##
## ---------------- ##

ac_cv_c_compiler_gnu=yes
ac_cv_c_const=yes
ac_cv_env_CC_set=
ac_cv_env_CC_value=
ac_cv_env_CFLAGS_set=set
ac_cv_env_CFLAGS_value='-arch i386 -arch x86_64 -g -Os -pipe -mdynamic-no-pic'
ac_cv_env_CPPFLAGS_set=
ac_cv_env_CPPFLAGS_value=
ac_cv_env_CPP_set=
ac_cv_env_CPP_value=
ac_cv_env_LDFLAGS_set=set
ac_cv_env_LDFLAGS_value='-arch i386 -arch x86_64'
ac_cv_env_LIBS_set=
ac_cv_env_LIBS_value=
ac_cv_env_XMKMF_set=
ac_cv_env_XMKMF_value=
ac_cv_env_build_alias_set=
ac_cv_env_build_alias_value=
ac_cv_env_host_alias_set=
ac_cv_env_host_alias_value=
ac_cv_env_target_alias_set=
ac_cv_env_target_alias_value=
ac_cv_func_bcmp=yes
ac_cv_func_copyfile=yes
ac_cv_func_fchdir=yes
ac_cv_func_fchown=yes
ac_cv_func_fseeko=yes
ac_cv_func_fsync=yes
ac_cv_func_ftello=yes
ac_cv_func_getcwd=yes
ac_cv_func_getpseudotty=no
ac_cv_func_getpwnam=yes
ac_cv_func_getpwuid=yes
ac_cv_func_getrlimit=yes
ac_cv_func_gettimeofday=yes
ac_cv_func_getwd=yes
ac_cv_func_iswupper=yes
ac_cv_func_lstat=yes
ac_cv_func_memcmp=yes
ac_cv_func_memset=yes
ac_cv_func_nanosleep=yes
ac_cv_func_opendir=yes
ac_cv_func_putenv=yes
ac_cv_func_qsort=yes
ac_cv_func_readlink=yes
ac_cv_func_select=yes
ac_cv_func_setenv=yes
ac_cv_func_setpgid=yes
ac_cv_func_setsid=yes
ac_cv_func_sigaction=yes
ac_cv_func_sigaltstack=yes
ac_cv_func_sigset=yes
ac_cv_func_sigsetjmp=yes
ac_cv_func_sigstack=no
ac_cv_func_sigvec=yes
ac_cv_func_strcasecmp=yes
ac_cv_func_strerror=yes
ac_cv_func_strftime=yes
ac_cv_func_stricmp=no
ac_cv_func_strncasecmp=yes
ac_cv_func_strnicmp=no
ac_cv_func_strpbrk=yes
ac_cv_func_strtol=yes
ac_cv_func_tgetent=yes
ac_cv_func_towlower=yes
ac_cv_func_towupper=yes
ac_cv_func_usleep=yes
ac_cv_func_utime=yes
ac_cv_func_utimes=yes
ac_cv_header_X11_SM_SMlib_h=yes
ac_cv_header_copyfile_h=yes
ac_cv_header_dirent_dirent_h=yes
ac_cv_header_dlfcn_h=yes
ac_cv_header_elf_h=no
ac_cv_header_errno_h=yes
ac_cv_header_fcntl_h=yes
ac_cv_header_frame_h=no
ac_cv_header_iconv_h=yes
ac_cv_header_langinfo_h=yes
ac_cv_header_libc_h=yes
ac_cv_header_libgen_h=yes
ac_cv_header_libintl_h=no
ac_cv_header_locale_h=yes
ac_cv_header_math_h=yes
ac_cv_header_poll_h=yes
ac_cv_header_pwd_h=yes
ac_cv_header_setjmp_h=yes
ac_cv_header_sgtty_h=yes
ac_cv_header_stdarg_h=yes
ac_cv_header_stdc=yes
ac_cv_header_stdlib_h=yes
ac_cv_header_string_h=yes
ac_cv_header_strings_h=yes
ac_cv_header_stropts_h=no
ac_cv_header_sys_access_h=no
ac_cv_header_sys_acl_h=yes
ac_cv_header_sys_ioctl_h=yes
ac_cv_header_sys_param_h=yes
ac_cv_header_sys_poll_h=yes
ac_cv_header_sys_ptem_h=no
ac_cv_header_sys_resource_h=yes
ac_cv_header_sys_select_h=yes
ac_cv_header_sys_statfs_h=no
ac_cv_header_sys_stream_h=no
ac_cv_header_sys_sysctl_h=yes
ac_cv_header_sys_sysinfo_h=no
ac_cv_header_sys_systeminfo_h=no
ac_cv_header_sys_time_h=yes
ac_cv_header_sys_types_h=yes
ac_cv_header_sys_utsname_h=yes
ac_cv_header_sys_wait_h=yes
ac_cv_header_termcap_h=yes
ac_cv_header_termio_h=no
ac_cv_header_termios_h=yes
ac_cv_header_time=yes
ac_cv_header_unistd_h=yes
ac_cv_header_util_debug_h=no
ac_cv_header_util_msg18n_h=no
ac_cv_header_utime_h=yes
ac_cv_header_wchar_h=yes
ac_cv_header_wctype_h=yes
ac_cv_lib_acl_acl_get_file=no
ac_cv_lib_m_strtod=yes
ac_cv_lib_nsl_gethostbyname=no
ac_cv_lib_posix1e_acl_get_file=no
ac_cv_lib_selinux_is_selinux_enabled=no
ac_cv_lib_socket_socket=no
ac_cv_lib_xpg4__xpg4_setrunelocale=no
ac_cv_objext=o
ac_cv_path_EGREP='/usr/bin/grep -E'
ac_cv_path_GREP=/usr/bin/grep
ac_cv_prog_AWK=awk
ac_cv_prog_CPP='gcc -E'
ac_cv_prog_STRIP=strip
ac_cv_prog_ac_ct_CC=gcc
ac_cv_prog_cc_c89=
ac_cv_prog_cc_g=yes
ac_cv_prog_gcc_traditional=no
ac_cv_prog_make_make_set=yes
ac_cv_search_opendir='none required'
ac_cv_search_strerror='none required'
ac_cv_sizeof_int=4
ac_cv_type_dev_t=yes
ac_cv_type_ino_t=yes
ac_cv_type_mode_t=yes
ac_cv_type_off_t=yes
ac_cv_type_pid_t=yes
ac_cv_type_rlim_t=yes
ac_cv_type_signal=void
ac_cv_type_size_t=yes
ac_cv_type_stack_t=yes
ac_cv_type_uid_t=yes
cf_cv_ebcdic=no
vi_cv_have_gpm=no
vi_cv_have_sysmouse=no
vim_cv_getcwd_broken=no
vim_cv_memmove_handles_overlap=yes
vim_cv_stat_ignores_slash=no
vim_cv_terminfo=yes
vim_cv_toupper_broken=no
vim_cv_tty_group=world

## ----------------- ##
## Output variables. ##
## ----------------- ##

AWK='awk'
CC='gcc'
CFLAGS='-arch i386 -arch x86_64 -g -Os -pipe -mdynamic-no-pic -D_FORTIFY_SOURCE=1'
CPP='gcc -E'
CPPFLAGS=''
CPP_MM='M'
DEFS='-DHAVE_CONFIG_H'
DEPEND_CFLAGS_FILTER='| sed '\''s+-I */+-isystem /+g'\'''
ECHO_C='\c'
ECHO_N=''
ECHO_T=''
EGREP='/usr/bin/grep -E'
EXEEXT=''
EXNAME='ex'
GNOME_CONFIG=''
GNOME_INCLUDEDIR=''
GNOME_LIBDIR=''
GNOME_LIBS=''
GREP='/usr/bin/grep'
GTK12_CONFIG=''
GTK_CFLAGS=''
GTK_CONFIG=''
GTK_LIBNAME=''
GTK_LIBS=''
GUITYPE='NONE'
GUI_INC_LOC=''
GUI_LIB_LOC=''
GUI_X_LIBS=''
HANGULIN_OBJ=''
HANGULIN_SRC=''
INSTALL_LANGS='install-languages'
INSTALL_TOOL_LANGS='install-tool-languages'
LDFLAGS='-arch i386 -arch x86_64 -L/usr/local/lib'
LIBOBJS=''
LIBS='-lm  -lncurses -liconv'
LTLIBOBJS=''
MAKEMO=''
MOTIF_LIBNAME=''
MSGFMT=''
MZSCHEME_CFLAGS=''
MZSCHEME_LIBS=''
MZSCHEME_OBJ=''
MZSCHEME_PRO=''
MZSCHEME_SRC=''
NARROW_PROTO=''
NETBEANS_OBJ='objects/netbeans.o'
NETBEANS_SRC='netbeans.c'
OBJEXT='o'
OS_EXTRA_OBJ=''
OS_EXTRA_SRC=''
PACKAGE_BUGREPORT=''
PACKAGE_NAME=''
PACKAGE_STRING=''
PACKAGE_TARNAME=''
PACKAGE_VERSION=''
PATH_SEPARATOR=':'
PERL_CFLAGS=''
PERL_LIBS=''
PERL_OBJ=''
PERL_PRO=''
PERL_SRC=''
PKG_CONFIG=''
PYTHON_CFLAGS=''
PYTHON_CONFDIR=''
PYTHON_GETPATH_CFLAGS=''
PYTHON_LIBS=''
PYTHON_OBJ=''
PYTHON_SRC=''
RUBY_CFLAGS=''
RUBY_LIBS=''
RUBY_OBJ=''
RUBY_PRO=''
RUBY_SRC=''
SET_MAKE=''
SHELL='/bin/sh'
SNIFF_OBJ=''
SNIFF_SRC=''
STRIP='strip'
TAGPRG='ctags -t'
TCL_CFLAGS=''
TCL_LIBS=''
TCL_OBJ=''
TCL_PRO=''
TCL_SRC=''
VIEWNAME='view'
VIMNAME='vim'
WORKSHOP_OBJ=''
WORKSHOP_SRC=''
XMKMF=''
X_CFLAGS=''
X_EXTRA_LIBS=''
X_LIB=''
X_LIBS=''
X_PRE_LIBS=''
ac_ct_CC='gcc'
bindir='${exec_prefix}/bin'
build_alias=''
compiledby=''
datadir='${datarootdir}'
datarootdir='${prefix}/share'
docdir='${datarootdir}/doc/${PACKAGE}'
dogvimdiff='installgvimdiff'
dovimdiff='installvimdiff'
dvidir='${docdir}'
exec_prefix='${prefix}'
host_alias=''
htmldir='${docdir}'
includedir='${prefix}/include'
infodir='/usr/share/info'
libdir='${exec_prefix}/lib'
libexecdir='${exec_prefix}/libexec'
line_break='"\\012"'
localedir='${datarootdir}/locale'
localstatedir='${prefix}/var'
mandir='/usr/share/man'
oldincludedir='/usr/include'
pdfdir='${docdir}'
prefix='/usr'
program_transform_name='s,x,x,'
psdir='${docdir}'
sbindir='${exec_prefix}/sbin'
sharedstatedir='${prefix}/com'
shrpenv=''
sysconfdir='${prefix}/etc'
target_alias=''
vi_cv_path_mzscheme=''
vi_cv_path_perl=''
vi_cv_path_python=''
vi_cv_path_ruby=''
vi_cv_path_tcl=''
vi_cv_perllib=''
xmkmfpath=''

## ----------- ##
## confdefs.h. ##
## ----------- ##

#define PACKAGE_NAME ""
#define PACKAGE_TARNAME ""
#define PACKAGE_VERSION ""
#define PACKAGE_STRING ""
#define PACKAGE_BUGREPORT ""
#define UNIX 1
#define STDC_HEADERS 1
#define HAVE_SYS_WAIT_H 1
#define FEAT_NORMAL 1
#define USE_XSMP_INTERACT 1
#define FEAT_CSCOPE 1
#define FEAT_NETBEANS_INTG 1
#define FEAT_MBYTE 1
#define HAVE_X11_SM_SMLIB_H 1
#define HAVE_DATE_TIME 1
#define HAVE_DIRENT_H 1
#define HAVE_STDARG_H 1
#define HAVE_STDLIB_H 1
#define HAVE_STRING_H 1
#define HAVE_SYS_SELECT_H 1
#define HAVE_SYS_UTSNAME_H 1
#define HAVE_TERMCAP_H 1
#define HAVE_FCNTL_H 1
#define HAVE_SGTTY_H 1
#define HAVE_SYS_IOCTL_H 1
#define HAVE_SYS_TIME_H 1
#define HAVE_SYS_TYPES_H 1
#define HAVE_ICONV_H 1
#define HAVE_LANGINFO_H 1
#define HAVE_MATH_H 1
#define HAVE_UNISTD_H 1
#define HAVE_ERRNO_H 1
#define HAVE_SYS_RESOURCE_H 1
#define HAVE_LOCALE_H 1
#define HAVE_TERMIOS_H 1
#define HAVE_LIBC_H 1
#define HAVE_POLL_H 1
#define HAVE_SYS_POLL_H 1
#define HAVE_PWD_H 1
#define HAVE_UTIME_H 1
#define HAVE_SYS_PARAM_H 1
#define HAVE_LIBGEN_H 1
#define HAVE_COPYFILE_H 1
#define HAVE_SYS_ACL_H 1
#define HAVE_SYS_SYSCTL_H 1
#define HAVE_WCHAR_H 1
#define HAVE_WCTYPE_H 1
#define HAVE_STRINGS_H 1
#define TIME_WITH_SYS_TIME 1
#define TERMINFO 1
#define HAVE_OSPEED 1
#define HAVE_UP_BC_PC 1
#define SYS_SELECT_WITH_SYS_TIME 1
#define HAVE_SVR4_PTYS 1
#define PTYRANGE0 "pqrstuvw"
#define PTYRANGE1 "0123456789abcdef"
#define RETSIGTYPE void
#define SIGRETURN return
#define HAVE_SIGCONTEXT 1
#define HAVE_BCMP 1
#define HAVE_FCHDIR 1
#define HAVE_FCHOWN 1
#define HAVE_FSEEKO 1
#define HAVE_FSYNC 1
#define HAVE_FTELLO 1
#define HAVE_GETCWD 1
#define HAVE_GETPWNAM 1
#define HAVE_GETPWUID 1
#define HAVE_GETRLIMIT 1
#define HAVE_GETTIMEOFDAY 1
#define HAVE_GETWD 1
#define HAVE_LSTAT 1
#define HAVE_MEMCMP 1
#define HAVE_MEMSET 1
#define HAVE_NANOSLEEP 1
#define HAVE_OPENDIR 1
#define HAVE_PUTENV 1
#define HAVE_QSORT 1
#define HAVE_READLINK 1
#define HAVE_SELECT 1
#define HAVE_SETENV 1
#define HAVE_SETPGID 1
#define HAVE_SETSID 1
#define HAVE_SIGALTSTACK 1
#define HAVE_SIGSET 1
#define HAVE_SIGSETJMP 1
#define HAVE_SIGACTION 1
#define HAVE_SIGVEC 1
#define HAVE_STRCASECMP 1
#define HAVE_STRERROR 1
#define HAVE_STRFTIME 1
#define HAVE_STRNCASECMP 1
#define HAVE_STRPBRK 1
#define HAVE_STRTOL 1
#define HAVE_TGETENT 1
#define HAVE_TOWLOWER 1
#define HAVE_TOWUPPER 1
#define HAVE_ISWUPPER 1
#define HAVE_USLEEP 1
#define HAVE_UTIME 1
#define HAVE_UTIMES 1
#define HAVE_COPYFILE 1
#define HAVE_ST_BLKSIZE 1
#define HAVE_ICONV 1
#define HAVE_NL_LANGINFO_CODESET 1
#define HAVE_LIBM 1
#define HAVE_FLOAT_FUNCS 1
#define HAVE_POSIX_ACL 1
#define HAVE_RENAME 1
#define HAVE_SYSCTL 1
#define SIZEOF_INT 4
#define USEMEMMOVE 1
#define USEMAN_S 1
#define HAVE_DLFCN_H 1
#define HAVE_DLOPEN 1
#define HAVE_DLSYM 1
#define HAVE_SETJMP_H 1

configure: exit 0